org.scalatest.junit

AssertionsForJUnit

trait AssertionsForJUnit extends Assertions

Trait that contains ScalaTest's basic assertion methods, suitable for use with JUnit.

The assertion methods provided in this trait look and behave exactly like the ones in Assertions, except instead of throwing TestFailedException they throw JUnitTestFailedError, which extends junit.framework.AssertionFailedError.

JUnit 3 (release 3.8 and earlier) distinguishes between failures and errors. If a test fails because of a failed assertion, that is considered a failure. If a test fails for any other reason, either the test code or the application being tested threw an unexpected exception, that is considered an error. The way JUnit 3 decides whether an exception represents a failure or error is that only thrown junit.framework.AssertionFailedErrors are considered failures. Any other exception type is considered an error. The exception type thrown by the JUnit 3 assertion methods declared in junit.framework.Assert (such as assertEquals, assertTrue, and fail) is, therefore, AssertionFailedError.

In JUnit 4, AssertionFailedError was made to extend java.lang.AssertionError, and the distinction between failures and errors was essentially dropped. However, some tools that integrate with JUnit carry on this distinction, so even if you are using JUnit 4 you may want to use this AssertionsForJUnit trait instead of plain-old ScalaTest Assertions.

To use this trait in a JUnit 3 TestCase, you can mix it into your TestCase class, like this:

import junit.framework.TestCase
import org.scalatest.junit.AssertionsForJUnit

class MyTestCase extends TestCase with AssertionsForJUnit {

  def testSomething() {
    assert("hi".charAt(1) === 'i')
  }

  // ...
}

You can alternatively import the methods defined in this trait.

import junit.framework.TestCase
import org.scalatest.junit.AssertionsForJUnit._

class MyTestCase extends TestCase {

  def testSomething() {
    assert("hi".charAt(1) === 'i')
  }

  // ...
}

For details on the importing approach, see the documentation for the AssertionsForJUnit companion object. For the details on the AssertionsForJUnit syntax, see the Scaladoc documentation for org.scalatest.Assertions

Linear Supertypes
Assertions, TripleEquals, TripleEqualsSupport, AnyRef, Any
Known Subclasses
Ordering
  1. Alphabetic
  2. By inheritance
Inherited
  1. AssertionsForJUnit
  2. Assertions
  3. TripleEquals
  4. TripleEqualsSupport
  5. AnyRef
  6. Any
  1. Hide All
  2. Show all
Learn more about member selection
Visibility
  1. Public
  2. All

Type Members

  1. class AssertionsHelper extends AnyRef

    Helper class used by code generated by the assert macro.

  2. class CheckingEqualizer[L] extends AnyRef

    Definition Classes
    TripleEqualsSupport
  3. class Equalizer[L] extends AnyRef

    Definition Classes
    TripleEqualsSupport

Value Members

  1. final def !=(arg0: AnyRef): Boolean

    Definition Classes
    AnyRef
  2. final def !=(arg0: Any): Boolean

    Definition Classes
    Any
  3. def !==[T](right: Spread[T]): TripleEqualsInvocationOnSpread[T]

    Definition Classes
    TripleEqualsSupport
  4. def !==(right: Null): TripleEqualsInvocation[Null]

    Definition Classes
    TripleEqualsSupport
  5. def !==[T](right: T): TripleEqualsInvocation[T]

    Definition Classes
    TripleEqualsSupport
  6. final def ##(): Int

    Definition Classes
    AnyRef → Any
  7. final def ==(arg0: AnyRef): Boolean

    Definition Classes
    AnyRef
  8. final def ==(arg0: Any): Boolean

    Definition Classes
    Any
  9. def ===[T](right: Spread[T]): TripleEqualsInvocationOnSpread[T]

    Definition Classes
    TripleEqualsSupport
  10. def ===(right: Null): TripleEqualsInvocation[Null]

    Definition Classes
    TripleEqualsSupport
  11. def ===[T](right: T): TripleEqualsInvocation[T]

    Definition Classes
    TripleEqualsSupport
  12. final def asInstanceOf[T0]: T0

    Definition Classes
    Any
  13. def assert(condition: Boolean, clue: Any): Assertion

    Assert that a boolean condition, described in String message, is true.

    Assert that a boolean condition, described in String message, is true. If the condition is true, this method returns normally. Else, it throws TestFailedException with a helpful error message appended with the String obtained by invoking toString on the specified clue as the exception's detail message.

    This method is implemented in terms of a Scala macro that will generate a more helpful error message for expressions of this form:

    • assert(a == b, "a good clue")
    • assert(a != b, "a good clue")
    • assert(a === b, "a good clue")
    • assert(a !== b, "a good clue")
    • assert(a > b, "a good clue")
    • assert(a >= b, "a good clue")
    • assert(a < b, "a good clue")
    • assert(a <= b, "a good clue")
    • assert(a startsWith "prefix", "a good clue")
    • assert(a endsWith "postfix", "a good clue")
    • assert(a contains "something", "a good clue")
    • assert(a eq b, "a good clue")
    • assert(a ne b, "a good clue")
    • assert(a > 0 && b > 5, "a good clue")
    • assert(a > 0 || b > 5, "a good clue")
    • assert(a.isEmpty, "a good clue")
    • assert(!a.isEmpty, "a good clue")
    • assert(a.isInstanceOf[String], "a good clue")
    • assert(a.length == 8, "a good clue")
    • assert(a.size == 8, "a good clue")
    • assert(a.exists(_ == 8), "a good clue")

    At this time, any other form of expression will just get a TestFailedException with message saying the given expression was false. In the future, we will enhance this macro to give helpful error messages in more situations. In ScalaTest 2.0, however, this behavior was sufficient to allow the === that returns Boolean to be the default in tests. This makes === consistent between tests and production code.

    condition

    the boolean condition to assert

    clue

    An objects whose toString method returns a message to include in a failure report.

    Definition Classes
    Assertions
    Annotations
    @macroImpl( ... )
    Exceptions thrown
    NullArgumentException

    if message is null.

    TestFailedException

    if the condition is false.

  14. def assert(condition: Boolean): Assertion

    Assert that a boolean condition is true.

    Assert that a boolean condition is true. If the condition is true, this method returns normally. Else, it throws TestFailedException.

    This method is implemented in terms of a Scala macro that will generate a more helpful error message for expressions of this form:

    • assert(a == b)
    • assert(a != b)
    • assert(a === b)
    • assert(a !== b)
    • assert(a > b)
    • assert(a >= b)
    • assert(a < b)
    • assert(a <= b)
    • assert(a startsWith "prefix")
    • assert(a endsWith "postfix")
    • assert(a contains "something")
    • assert(a eq b)
    • assert(a ne b)
    • assert(a > 0 && b > 5)
    • assert(a > 0 || b > 5)
    • assert(a.isEmpty)
    • assert(!a.isEmpty)
    • assert(a.isInstanceOf[String])
    • assert(a.length == 8)
    • assert(a.size == 8)
    • assert(a.exists(_ == 8))

    At this time, any other form of expression will get a TestFailedException with message saying the given expression was false. In the future, we will enhance this macro to give helpful error messages in more situations. In ScalaTest 2.0, however, this behavior was sufficient to allow the === that returns Boolean to be the default in tests. This makes === consistent between tests and production code.

    condition

    the boolean condition to assert

    Definition Classes
    Assertions
    Annotations
    @macroImpl( ... )
    Exceptions thrown
    TestFailedException

    if the condition is false.

  15. def assertCompiles(code: String): Assertion

    Asserts that a given string snippet of code passes both the Scala parser and type checker.

    Asserts that a given string snippet of code passes both the Scala parser and type checker.

    You can use this to make sure a snippet of code compiles:

    assertCompiles("val a: Int = 1")
    

    Although assertCompiles is implemented with a macro that determines at compile time whether the snippet of code represented by the passed string compiles, errors (i.e., snippets of code that do not compile) are reported as test failures at runtime.

    code

    the snippet of code that should compile

    Definition Classes
    Assertions
    Annotations
    @macroImpl( ... )
  16. def assertDoesNotCompile(code: String): Assertion

    Asserts that a given string snippet of code does not pass either the Scala parser or type checker.

    Asserts that a given string snippet of code does not pass either the Scala parser or type checker.

    Often when creating libraries you may wish to ensure that certain arrangements of code that represent potential “user errors” do not compile, so that your library is more error resistant. ScalaTest's Assertions trait includes the following syntax for that purpose:

    assertDoesNotCompile("val a: String = \"a string")
    

    Although assertDoesNotCompile is implemented with a macro that determines at compile time whether the snippet of code represented by the passed string doesn't compile, errors (i.e., snippets of code that do compile) are reported as test failures at runtime.

    Note that the difference between assertTypeError and assertDoesNotCompile is that assertDoesNotCompile will succeed if the given code does not compile for any reason, whereas assertTypeError will only succeed if the given code does not compile because of a type error. If the given code does not compile because of a syntax error, for example, assertDoesNotCompile will return normally but assertTypeError will throw a TestFailedException.

    code

    the snippet of code that should not type check

    Definition Classes
    Assertions
    Annotations
    @macroImpl( ... )
  17. def assertResult(expected: Any)(actual: Any): Assertion

    Assert that the value passed as expected equals the value passed as actual.

    Assert that the value passed as expected equals the value passed as actual. If the actual value equals the expected value (as determined by ==), assertResult returns normally. Else, assertResult throws a TestFailedException whose detail message includes the expected and actual values.

    expected

    the expected value

    actual

    the actual value, which should equal the passed expected value

    Definition Classes
    Assertions
    Exceptions thrown
    TestFailedException

    if the passed actual value does not equal the passed expected value.

  18. def assertResult(expected: Any, clue: Any)(actual: Any): Assertion

    Assert that the value passed as expected equals the value passed as actual.

    Assert that the value passed as expected equals the value passed as actual. If the actual equals the expected (as determined by ==), assertResult returns normally. Else, if actual is not equal to expected, assertResult throws a TestFailedException whose detail message includes the expected and actual values, as well as the String obtained by invoking toString on the passed clue.

    expected

    the expected value

    clue

    An object whose toString method returns a message to include in a failure report.

    actual

    the actual value, which should equal the passed expected value

    Definition Classes
    Assertions
    Exceptions thrown
    TestFailedException

    if the passed actual value does not equal the passed expected value.

  19. def assertThrows[T <: AnyRef](f: ⇒ Any)(implicit classTag: ClassTag[T]): Assertion

    Ensure that an expected exception is thrown by the passed function value.

    Ensure that an expected exception is thrown by the passed function value. The thrown exception must be an instance of the type specified by the type parameter of this method. This method invokes the passed function. If the function throws an exception that's an instance of the specified type, this method returns Succeeded. Else, whether the passed function returns normally or completes abruptly with a different exception, this method throws TestFailedException.

    Note that the type specified as this method's type parameter may represent any subtype of AnyRef, not just Throwable or one of its subclasses. In Scala, exceptions can be caught based on traits they implement, so it may at times make sense to specify a trait that the intercepted exception's class must mix in. If a class instance is passed for a type that could not possibly be used to catch an exception (such as String, for example), this method will complete abruptly with a TestFailedException.

    Also note that the difference between this method and intercept is that this method does not return the expected exception, so it does not let you perform further assertions on that exception. Instead, this method returns Succeeded, which means it can serve as the last statement in an async- or safe-style suite. It also indicates to the reader of the code that nothing further is expected about the thrown exception other than its type. The recommended usage is to use assertThrows by default, intercept only when you need to inspect the caught exception further.

    f

    the function value that should throw the expected exception

    classTag

    an implicit ClassTag representing the type of the specified type parameter.

    returns

    the Succeeded singleton, if an exception of the expected type is thrown

    Definition Classes
    Assertions
    Exceptions thrown
    TestFailedException

    if the passed function does not complete abruptly with an exception that's an instance of the specified type.

  20. def assertTypeError(code: String): Assertion

    Asserts that a given string snippet of code does not pass the Scala type checker, failing if the given snippet does not pass the Scala parser.

    Asserts that a given string snippet of code does not pass the Scala type checker, failing if the given snippet does not pass the Scala parser.

    Often when creating libraries you may wish to ensure that certain arrangements of code that represent potential “user errors” do not compile, so that your library is more error resistant. ScalaTest's Assertions trait includes the following syntax for that purpose:

    assertTypeError("val a: String = 1")
    

    Although assertTypeError is implemented with a macro that determines at compile time whether the snippet of code represented by the passed string type checks, errors (i.e., snippets of code that do type check) are reported as test failures at runtime.

    Note that the difference between assertTypeError and assertDoesNotCompile is that assertDoesNotCompile will succeed if the given code does not compile for any reason, whereas assertTypeError will only succeed if the given code does not compile because of a type error. If the given code does not compile because of a syntax error, for example, assertDoesNotCompile will return normally but assertTypeError will throw a TestFailedException.

    code

    the snippet of code that should not type check

    Definition Classes
    Assertions
    Annotations
    @macroImpl( ... )
  21. val assertionsHelper: AssertionsHelper

    Helper instance used by code generated by macro assertion.

    Helper instance used by code generated by macro assertion.

    Definition Classes
    Assertions
  22. def assume(condition: Boolean, clue: Any): Assertion

    Assume that a boolean condition, described in String message, is true.

    Assume that a boolean condition, described in String message, is true. If the condition is true, this method returns normally. Else, it throws TestCanceledException with a helpful error message appended with String obtained by invoking toString on the specified clue as the exception's detail message.

    This method is implemented in terms of a Scala macro that will generate a more helpful error message for expressions of this form:

    • assume(a == b, "a good clue")
    • assume(a != b, "a good clue")
    • assume(a === b, "a good clue")
    • assume(a !== b, "a good clue")
    • assume(a > b, "a good clue")
    • assume(a >= b, "a good clue")
    • assume(a < b, "a good clue")
    • assume(a <= b, "a good clue")
    • assume(a startsWith "prefix", "a good clue")
    • assume(a endsWith "postfix", "a good clue")
    • assume(a contains "something", "a good clue")
    • assume(a eq b, "a good clue")
    • assume(a ne b, "a good clue")
    • assume(a > 0 && b > 5, "a good clue")
    • assume(a > 0 || b > 5, "a good clue")
    • assume(a.isEmpty, "a good clue")
    • assume(!a.isEmpty, "a good clue")
    • assume(a.isInstanceOf[String], "a good clue")
    • assume(a.length == 8, "a good clue")
    • assume(a.size == 8, "a good clue")
    • assume(a.exists(_ == 8), "a good clue")

    At this time, any other form of expression will just get a TestCanceledException with message saying the given expression was false. In the future, we will enhance this macro to give helpful error messages in more situations. In ScalaTest 2.0, however, this behavior was sufficient to allow the === that returns Boolean to be the default in tests. This makes === consistent between tests and production code.

    condition

    the boolean condition to assume

    clue

    An objects whose toString method returns a message to include in a failure report.

    Definition Classes
    Assertions
    Annotations
    @macroImpl( ... )
    Exceptions thrown
    NullArgumentException

    if message is null.

    TestCanceledException

    if the condition is false.

  23. def assume(condition: Boolean): Assertion

    Assume that a boolean condition is true.

    Assume that a boolean condition is true. If the condition is true, this method returns normally. Else, it throws TestCanceledException.

    This method is implemented in terms of a Scala macro that will generate a more helpful error message for expressions of this form:

    • assume(a == b)
    • assume(a != b)
    • assume(a === b)
    • assume(a !== b)
    • assume(a > b)
    • assume(a >= b)
    • assume(a < b)
    • assume(a <= b)
    • assume(a startsWith "prefix")
    • assume(a endsWith "postfix")
    • assume(a contains "something")
    • assume(a eq b)
    • assume(a ne b)
    • assume(a > 0 && b > 5)
    • assume(a > 0 || b > 5)
    • assume(a.isEmpty)
    • assume(!a.isEmpty)
    • assume(a.isInstanceOf[String])
    • assume(a.length == 8)
    • assume(a.size == 8)
    • assume(a.exists(_ == 8))

    At this time, any other form of expression will just get a TestCanceledException with message saying the given expression was false. In the future, we will enhance this macro to give helpful error messages in more situations. In ScalaTest 2.0, however, this behavior was sufficient to allow the === that returns Boolean to be the default in tests. This makes === consistent between tests and production code.

    condition

    the boolean condition to assume

    Definition Classes
    Assertions
    Annotations
    @macroImpl( ... )
    Exceptions thrown
    TestCanceledException

    if the condition is false.

  24. def cancel(cause: Throwable): Nothing

    Throws TestCanceledException, with the passed Throwable cause, to indicate a test failed.

    Throws TestCanceledException, with the passed Throwable cause, to indicate a test failed. The getMessage method of the thrown TestCanceledException will return cause.toString.

    cause

    a Throwable that indicates the cause of the cancellation.

    Definition Classes
    Assertions
    Exceptions thrown
    NullArgumentException

    if cause is null

  25. def cancel(message: String, cause: Throwable): Nothing

    Throws TestCanceledException, with the passed String message as the exception's detail message and Throwable cause, to indicate a test failed.

    Throws TestCanceledException, with the passed String message as the exception's detail message and Throwable cause, to indicate a test failed.

    message

    A message describing the failure.

    cause

    A Throwable that indicates the cause of the failure.

    Definition Classes
    Assertions
    Exceptions thrown
    NullArgumentException

    if message or cause is null

  26. def cancel(message: String): Nothing

    Throws TestCanceledException, with the passed String message as the exception's detail message, to indicate a test was canceled.

    Throws TestCanceledException, with the passed String message as the exception's detail message, to indicate a test was canceled.

    message

    A message describing the cancellation.

    Definition Classes
    Assertions
    Exceptions thrown
    NullArgumentException

    if message is null

  27. def cancel(): Nothing

    Throws TestCanceledException to indicate a test was canceled.

    Throws TestCanceledException to indicate a test was canceled.

    Definition Classes
    Assertions
  28. def clone(): AnyRef

    Attributes
    protected[java.lang]
    Definition Classes
    AnyRef
    Annotations
    @throws( ... )
  29. def conversionCheckedConstraint[A, B](implicit equivalenceOfA: Equivalence[A], cnv: (B) ⇒ A): CanEqual[A, B]

    Definition Classes
    TripleEquals → TripleEqualsSupport
  30. def convertEquivalenceToAToBConstraint[A, B](equivalenceOfB: Equivalence[B])(implicit ev: <:<[A, B]): CanEqual[A, B]

    Definition Classes
    TripleEquals → TripleEqualsSupport
  31. def convertEquivalenceToAToBConversionConstraint[A, B](equivalenceOfB: Equivalence[B])(implicit ev: (A) ⇒ B): CanEqual[A, B]

    Definition Classes
    TripleEquals → TripleEqualsSupport
  32. def convertEquivalenceToBToAConstraint[A, B](equivalenceOfA: Equivalence[A])(implicit ev: <:<[B, A]): CanEqual[A, B]

    Definition Classes
    TripleEquals → TripleEqualsSupport
  33. def convertEquivalenceToBToAConversionConstraint[A, B](equivalenceOfA: Equivalence[A])(implicit ev: (B) ⇒ A): CanEqual[A, B]

    Definition Classes
    TripleEquals → TripleEqualsSupport
  34. def convertToCheckingEqualizer[T](left: T): CheckingEqualizer[T]

    Definition Classes
    TripleEquals → TripleEqualsSupport
  35. implicit def convertToEqualizer[T](left: T): Equalizer[T]

    Definition Classes
    TripleEquals → TripleEqualsSupport
  36. def defaultEquality[A]: Equality[A]

    Definition Classes
    TripleEqualsSupport
  37. final def eq(arg0: AnyRef): Boolean

    Definition Classes
    AnyRef
  38. def equals(arg0: Any): Boolean

    Definition Classes
    AnyRef → Any
  39. def fail(cause: Throwable): Nothing

    Throws TestFailedException, with the passed Throwable cause, to indicate a test failed.

    Throws TestFailedException, with the passed Throwable cause, to indicate a test failed. The getMessage method of the thrown TestFailedException will return cause.toString.

    cause

    a Throwable that indicates the cause of the failure.

    Definition Classes
    Assertions
    Exceptions thrown
    NullArgumentException

    if cause is null

  40. def fail(message: String, cause: Throwable): Nothing

    Throws TestFailedException, with the passed String message as the exception's detail message and Throwable cause, to indicate a test failed.

    Throws TestFailedException, with the passed String message as the exception's detail message and Throwable cause, to indicate a test failed.

    message

    A message describing the failure.

    cause

    A Throwable that indicates the cause of the failure.

    Definition Classes
    Assertions
    Exceptions thrown
    NullArgumentException

    if message or cause is null

  41. def fail(message: String): Nothing

    Throws TestFailedException, with the passed String message as the exception's detail message, to indicate a test failed.

    Throws TestFailedException, with the passed String message as the exception's detail message, to indicate a test failed.

    message

    A message describing the failure.

    Definition Classes
    Assertions
    Exceptions thrown
    NullArgumentException

    if message is null

  42. def fail(): Nothing

    Throws TestFailedException to indicate a test failed.

    Throws TestFailedException to indicate a test failed.

    Definition Classes
    Assertions
  43. def finalize(): Unit

    Attributes
    protected[java.lang]
    Definition Classes
    AnyRef
    Annotations
    @throws( classOf[java.lang.Throwable] )
  44. final def getClass(): Class[_]

    Definition Classes
    AnyRef → Any
  45. def hashCode(): Int

    Definition Classes
    AnyRef → Any
  46. def intercept[T <: AnyRef](f: ⇒ Any)(implicit classTag: ClassTag[T]): T

    Intercept and return an exception that's expected to be thrown by the passed function value.

    Intercept and return an exception that's expected to be thrown by the passed function value. The thrown exception must be an instance of the type specified by the type parameter of this method. This method invokes the passed function. If the function throws an exception that's an instance of the specified type, this method returns that exception. Else, whether the passed function returns normally or completes abruptly with a different exception, this method throws TestFailedException.

    Note that the type specified as this method's type parameter may represent any subtype of AnyRef, not just Throwable or one of its subclasses. In Scala, exceptions can be caught based on traits they implement, so it may at times make sense to specify a trait that the intercepted exception's class must mix in. If a class instance is passed for a type that could not possibly be used to catch an exception (such as String, for example), this method will complete abruptly with a TestFailedException.

    Also note that the difference between this method and assertThrows is that this method returns the expected exception, so it lets you perform further assertions on that exception. By contrast, the assertThrows method returns Succeeded, which means it can serve as the last statement in an async- or safe-style suite. assertThrows also indicates to the reader of the code that nothing further is expected about the thrown exception other than its type. The recommended usage is to use assertThrows by default, intercept only when you need to inspect the caught exception further.

    f

    the function value that should throw the expected exception

    classTag

    an implicit ClassTag representing the type of the specified type parameter.

    returns

    the intercepted exception, if it is of the expected type

    Definition Classes
    Assertions
    Exceptions thrown
    TestFailedException

    if the passed function does not complete abruptly with an exception that's an instance of the specified type.

  47. final def isInstanceOf[T0]: Boolean

    Definition Classes
    Any
  48. def lowPriorityConversionCheckedConstraint[A, B](implicit equivalenceOfB: Equivalence[B], cnv: (A) ⇒ B): CanEqual[A, B]

    Definition Classes
    TripleEquals → TripleEqualsSupport
  49. def lowPriorityTypeCheckedConstraint[A, B](implicit equivalenceOfB: Equivalence[B], ev: <:<[A, B]): CanEqual[A, B]

    Definition Classes
    TripleEquals → TripleEqualsSupport
  50. final def ne(arg0: AnyRef): Boolean

    Definition Classes
    AnyRef
  51. final def notify(): Unit

    Definition Classes
    AnyRef
  52. final def notifyAll(): Unit

    Definition Classes
    AnyRef
  53. def pending: Assertion with PendingStatement

    Throws TestPendingException to indicate a test is pending.

    Throws TestPendingException to indicate a test is pending.

    A pending test is one that has been given a name but is not yet implemented. The purpose of pending tests is to facilitate a style of testing in which documentation of behavior is sketched out before tests are written to verify that behavior (and often, the before the behavior of the system being tested is itself implemented). Such sketches form a kind of specification of what tests and functionality to implement later.

    To support this style of testing, a test can be given a name that specifies one bit of behavior required by the system being tested. The test can also include some code that sends more information about the behavior to the reporter when the tests run. At the end of the test, it can call method pending, which will cause it to complete abruptly with TestPendingException. Because tests in ScalaTest can be designated as pending with TestPendingException, both the test name and any information sent to the reporter when running the test can appear in the report of a test run. (In other words, the code of a pending test is executed just like any other test.) However, because the test completes abruptly with TestPendingException, the test will be reported as pending, to indicate the actual test, and possibly the functionality it is intended to test, has not yet been implemented.

    Note: This method always completes abruptly with a TestPendingException. Thus it always has a side effect. Methods with side effects are usually invoked with parentheses, as in pending(). This method is defined as a parameterless method, in flagrant contradiction to recommended Scala style, because it forms a kind of DSL for pending tests. It enables tests in suites such as FunSuite or FunSpec to be denoted by placing "(pending)" after the test name, as in:

    test("that style rules are not laws") (pending)
    

    Readers of the code see "pending" in parentheses, which looks like a little note attached to the test name to indicate it is pending. Whereas "(pending()) looks more like a method call, "(pending)" lets readers stay at a higher level, forgetting how it is implemented and just focusing on the intent of the programmer who wrote the code.

    Definition Classes
    Assertions
  54. def pendingUntilFixed(f: ⇒ Unit): Assertion with PendingStatement

    Execute the passed block of code, and if it completes abruptly, throw TestPendingException, else throw TestFailedException.

    Execute the passed block of code, and if it completes abruptly, throw TestPendingException, else throw TestFailedException.

    This method can be used to temporarily change a failing test into a pending test in such a way that it will automatically turn back into a failing test once the problem originally causing the test to fail has been fixed. At that point, you need only remove the pendingUntilFixed call. In other words, a pendingUntilFixed surrounding a block of code that isn't broken is treated as a test failure. The motivation for this behavior is to encourage people to remove pendingUntilFixed calls when there are no longer needed.

    This method facilitates a style of testing in which tests are written before the code they test. Sometimes you may encounter a test failure that requires more functionality than you want to tackle without writing more tests. In this case you can mark the bit of test code causing the failure with pendingUntilFixed. You can then write more tests and functionality that eventually will get your production code to a point where the original test won't fail anymore. At this point the code block marked with pendingUntilFixed will no longer throw an exception (because the problem has been fixed). This will in turn cause pendingUntilFixed to throw TestFailedException with a detail message explaining you need to go back and remove the pendingUntilFixed call as the problem orginally causing your test code to fail has been fixed.

    f

    a block of code, which if it completes abruptly, should trigger a TestPendingException

    Definition Classes
    Assertions
    Exceptions thrown
    TestPendingException

    if the passed block of code completes abruptly with an Exception or AssertionError

  55. final val succeed: Succeeded.type

    Definition Classes
    Assertions
  56. final def synchronized[T0](arg0: ⇒ T0): T0

    Definition Classes
    AnyRef
  57. def toString(): String

    Definition Classes
    AnyRef → Any
  58. def trap[T](f: ⇒ T): Throwable

    Trap and return any thrown exception that would normally cause a ScalaTest test to fail, or create and return a new RuntimeException indicating no exception is thrown.

    Trap and return any thrown exception that would normally cause a ScalaTest test to fail, or create and return a new RuntimeException indicating no exception is thrown.

    This method is intended to be used in the Scala interpreter to eliminate large stack traces when trying out ScalaTest assertions and matcher expressions. It is not intended to be used in regular test code. If you want to ensure that a bit of code throws an expected exception, use intercept, not trap. Here's an example interpreter session without trap:

    scala> import org.scalatest._
    import org.scalatest._
    
    scala> import Matchers._
    import Matchers._
    
    scala> val x = 12
    a: Int = 12
    
    scala> x shouldEqual 13
    org.scalatest.exceptions.TestFailedException: 12 did not equal 13
       at org.scalatest.Assertions$class.newAssertionFailedException(Assertions.scala:449)
       at org.scalatest.Assertions$.newAssertionFailedException(Assertions.scala:1203)
       at org.scalatest.Assertions$AssertionsHelper.macroAssertTrue(Assertions.scala:417)
       at .<init>(<console>:15)
       at .<clinit>(<console>)
       at .<init>(<console>:7)
       at .<clinit>(<console>)
       at $print(<console>)
       at sun.reflect.NativeMethodAccessorImpl.invoke0(Native Method)
       at sun.reflect.NativeMethodAccessorImpl.invoke(NativeMethodAccessorImpl.java:39)
       at sun.reflect.DelegatingMethodAccessorImpl.invoke(DelegatingMethodAccessorImpl.java:25)
       at java.lang.reflect.Method.invoke(Method.java:597)
       at scala.tools.nsc.interpreter.IMain$ReadEvalPrint.call(IMain.scala:731)
       at scala.tools.nsc.interpreter.IMain$Request.loadAndRun(IMain.scala:980)
       at scala.tools.nsc.interpreter.IMain.loadAndRunReq$1(IMain.scala:570)
       at scala.tools.nsc.interpreter.IMain.interpret(IMain.scala:601)
       at scala.tools.nsc.interpreter.IMain.interpret(IMain.scala:565)
       at scala.tools.nsc.interpreter.ILoop.reallyInterpret$1(ILoop.scala:745)
       at scala.tools.nsc.interpreter.ILoop.interpretStartingWith(ILoop.scala:790)
       at scala.tools.nsc.interpreter.ILoop.command(ILoop.scala:702)
       at scala.tools.nsc.interpreter.ILoop.processLine$1(ILoop.scala:566)
       at scala.tools.nsc.interpreter.ILoop.innerLoop$1(ILoop.scala:573)
       at scala.tools.nsc.interpreter.ILoop.loop(ILoop.scala:576)
       at scala.tools.nsc.interpreter.ILoop$$anonfun$process$1.apply$mcZ$sp(ILoop.scala:867)
       at scala.tools.nsc.interpreter.ILoop$$anonfun$process$1.apply(ILoop.scala:822)
       at scala.tools.nsc.interpreter.ILoop$$anonfun$process$1.apply(ILoop.scala:822)
       at scala.tools.nsc.util.ScalaClassLoader$.savingContextLoader(ScalaClassLoader.scala:135)
       at scala.tools.nsc.interpreter.ILoop.process(ILoop.scala:822)
       at scala.tools.nsc.MainGenericRunner.runTarget$1(MainGenericRunner.scala:83)
       at scala.tools.nsc.MainGenericRunner.process(MainGenericRunner.scala:96)
       at scala.tools.nsc.MainGenericRunner$.main(MainGenericRunner.scala:105)
       at scala.tools.nsc.MainGenericRunner.main(MainGenericRunner.scala)
    

    That's a pretty tall stack trace. Here's what it looks like when you use trap:

    scala> trap { x shouldEqual 13 }
    res1: Throwable = org.scalatest.exceptions.TestFailedException: 12 did not equal 13
    

    Much less clutter. Bear in mind, however, that if no exception is thrown by the passed block of code, the trap method will create a new NormalResult (a subclass of Throwable made for this purpose only) and return that. If the result was the Unit value, it will simply say that no exception was thrown:

    scala> trap { x shouldEqual 12 }
    res2: Throwable = No exception was thrown.
    

    If the passed block of code results in a value other than Unit, the NormalResult's toString will print the value:

    scala> trap { "Dude!" }
    res3: Throwable = No exception was thrown. Instead, result was: "Dude!"
    

    Although you can access the result value from the NormalResult, its type is Any and therefore not very convenient to use. It is not intended that trap be used in test code. The sole intended use case for trap is decluttering Scala interpreter sessions by eliminating stack traces when executing assertion and matcher expressions.

    Definition Classes
    Assertions
  59. def typeCheckedConstraint[A, B](implicit equivalenceOfA: Equivalence[A], ev: <:<[B, A]): CanEqual[A, B]

    Definition Classes
    TripleEquals → TripleEqualsSupport
  60. implicit def unconstrainedEquality[A, B](implicit equalityOfA: Equality[A]): CanEqual[A, B]

    Definition Classes
    TripleEquals → TripleEqualsSupport
  61. final def wait(): Unit

    Definition Classes
    AnyRef
    Annotations
    @throws( ... )
  62. final def wait(arg0: Long, arg1: Int): Unit

    Definition Classes
    AnyRef
    Annotations
    @throws( ... )
  63. final def wait(arg0: Long): Unit

    Definition Classes
    AnyRef
    Annotations
    @throws( ... )
  64. def withClue[T](clue: Any)(fun: ⇒ T): T

    Executes the block of code passed as the second parameter, and, if it completes abruptly with a ModifiableMessage exception, prepends the "clue" string passed as the first parameter to the beginning of the detail message of that thrown exception, then rethrows it.

    Executes the block of code passed as the second parameter, and, if it completes abruptly with a ModifiableMessage exception, prepends the "clue" string passed as the first parameter to the beginning of the detail message of that thrown exception, then rethrows it. If clue does not end in a white space character, one space will be added between it and the existing detail message (unless the detail message is not defined).

    This method allows you to add more information about what went wrong that will be reported when a test fails. Here's an example:

    withClue("(Employee's name was: " + employee.name + ")") {
      intercept[IllegalArgumentException] {
        employee.getTask(-1)
      }
    }
    

    If an invocation of intercept completed abruptly with an exception, the resulting message would be something like:

    (Employee's name was Bob Jones) Expected IllegalArgumentException to be thrown, but no exception was thrown
    

    Definition Classes
    Assertions
    Exceptions thrown
    NullArgumentException

    if the passed clue is null

Inherited from Assertions

Inherited from TripleEquals

Inherited from TripleEqualsSupport

Inherited from AnyRef

Inherited from Any

Ungrouped