Class

org.scalatest.fixture

LogicFunSuite

Related Doc: package fixture

Permalink

abstract class LogicFunSuite extends LogicFunSuiteLike

A sister class to org.scalatest.LogicFunSuite that can pass a fixture object into its tests.

Recommended Usage: Use class fixture.LogicFunSuite in situations for which LogicFunSuite would be a good choice, when all or most tests need the same fixture objects that must be cleaned up afterwards. Note: fixture.LogicFunSuite is intended for use in special situations, with class LogicFunSuite used for general needs. For more insight into where fixture.LogicFunSuite fits in the big picture, see the withFixture(OneArgTest) subsection of the Shared fixtures section in the documentation for class LogicFunSuite.

Class fixture.LogicFunSuite behaves similarly to class org.scalatest.LogicFunSuite, except that tests may have a fixture parameter. The type of the fixture parameter is defined by the abstract FixtureParam type, which is a member of this class. This class also contains an abstract withFixture method. This withFixture method takes a OneArgTest, which is a nested trait defined as a member of this class. OneArgTest has an apply method that takes a FixtureParam. This apply method is responsible for running a test. This class's runTest method delegates the actual running of each test to withFixture(OneArgTest), passing in the test code to run via the OneArgTest argument. The withFixture(OneArgTest) method (abstract in this class) is responsible for creating the fixture argument and passing it to the test function.

Subclasses of this class must, therefore, do three things differently from a plain old org.scalatest.LogicFunSuite:

If the fixture you want to pass into your tests consists of multiple objects, you will need to combine them into one object to use this class. One good approach to passing multiple fixture objects is to encapsulate them in a case class. Here's an example:

case class FixtureParam(file: File, writer: FileWriter)

To enable the stacking of traits that define withFixture(NoArgTest), it is a good idea to let withFixture(NoArgTest) invoke the test function instead of invoking the test function directly. To do so, you'll need to convert the OneArgTest to a NoArgTest. You can do that by passing the fixture object to the toNoArgTest method of OneArgTest. In other words, instead of writing “test(theFixture)”, you'd delegate responsibility for invoking the test function to the withFixture(NoArgTest) method of the same instance by writing:

withFixture(test.toNoArgTest(theFixture))

Here's a complete example:

package org.scalatest.examples.funsuite.oneargtest

import org.scalatest.fixture
import java.io._

class ExampleSuite extends fixture.LogicFunSuite {

  case class FixtureParam(file: File, writer: FileWriter)

  def withFixture(test: OneArgTest) = {

    // create the fixture
    val file = File.createTempFile("hello", "world")
    val writer = new FileWriter(file)
    val theFixture = FixtureParam(file, writer)

    try {
      writer.write("ScalaTest is ") // set up the fixture
      withFixture(test.toNoArgTest(theFixture)) // "loan" the fixture to the test
    }
    finally writer.close() // clean up the fixture
  }

  test("testing should be easy") { f =>
    f.writer.write("easy!")
    f.writer.flush()
    assert(f.file.length === 18)
  }

  test("testing should be fun") { f =>
    f.writer.write("fun!")
    f.writer.flush()
    assert(f.file.length === 17)
  }
}

If a test fails, the OneArgTest function will result in a Failed wrapping the exception describing the failure. To ensure clean up happens even if a test fails, you should invoke the test function from inside a try block and do the cleanup in a finally clause, as shown in the previous example.

Sharing fixtures across classes

If multiple test classes need the same fixture, you can define the FixtureParam and withFixture(OneArgTest) implementations in a trait, then mix that trait into the test classes that need it. For example, if your application requires a database and your integration tests use that database, you will likely have many test classes that need a database fixture. You can create a "database fixture" trait that creates a database with a unique name, passes the connector into the test, then removes the database once the test completes. This is shown in the following example:

package org.scalatest.examples.fixture.funsuite.sharing

import java.util.concurrent.ConcurrentHashMap
import org.scalatest.fixture
import DbServer._
import java.util.UUID.randomUUID

object DbServer { // Simulating a database server
  type Db = StringBuffer
  private val databases = new ConcurrentHashMap[String, Db]
  def createDb(name: String): Db = {
    val db = new StringBuffer
    databases.put(name, db)
    db
  }
  def removeDb(name: String) {
    databases.remove(name)
  }
}

trait DbFixture { this: fixture.Suite =>

  type FixtureParam = Db

  // Allow clients to populate the database after
  // it is created
  def populateDb(db: Db) {}

  def withFixture(test: OneArgTest) = {
    val dbName = randomUUID.toString
    val db = createDb(dbName) // create the fixture
    try {
      populateDb(db) // setup the fixture
      withFixture(test.toNoArgTest(db)) // "loan" the fixture to the test
    }
    finally removeDb(dbName) // clean up the fixture
  }
}

class ExampleSuite extends fixture.LogicFunSuite with DbFixture {

  override def populateDb(db: Db) { // setup the fixture
    db.append("ScalaTest is ")
  }

  test("testing should be easy") { db =>
    db.append("easy!")
    assert(db.toString === "ScalaTest is easy!")
  }

  test("testing should be fun") { db =>
    db.append("fun!")
    assert(db.toString === "ScalaTest is fun!")
  }

  // This test doesn't need a Db
  test("test code should be clear") { () =>
    val buf = new StringBuffer
    buf.append("ScalaTest code is ")
    buf.append("clear!")
    assert(buf.toString === "ScalaTest code is clear!")
  }
}

Often when you create fixtures in a trait like DbFixture, you'll still need to enable individual test classes to "setup" a newly created fixture before it gets passed into the tests. A good way to accomplish this is to pass the newly created fixture into a setup method, like populateDb in the previous example, before passing it to the test function. Classes that need to perform such setup can override the method, as does ExampleSuite.

If a test doesn't need the fixture, you can indicate that by providing a no-arg instead of a one-arg function, as is done in the third test in the previous example, “test code should be clear”. In other words, instead of starting your function literal with something like “db =>”, you'd start it with “() =>”. For such tests, runTest will not invoke withFixture(OneArgTest). It will instead directly invoke withFixture(NoArgTest).

Both examples shown above demonstrate the technique of giving each test its own "fixture sandbox" to play in. When your fixtures involve external side-effects, like creating files or databases, it is a good idea to give each file or database a unique name as is done in these examples. This keeps tests completely isolated, allowing you to run them in parallel if desired. You could mix ParallelTestExecution into either of these ExampleSuite classes, and the tests would run in parallel just fine.

Annotations
@Finders()
Linear Supertypes
LogicFunSuiteLike, Documenting, Alerting, Notifying, Informing, LogicTestRegistration, TestSuite, scalatest.TestSuite, Suite, scalatest.Suite, Serializable, Serializable, Assertions, TripleEquals, TripleEqualsSupport, AnyRef, Any
Ordering
  1. Alphabetic
  2. By Inheritance
Inherited
  1. LogicFunSuite
  2. LogicFunSuiteLike
  3. Documenting
  4. Alerting
  5. Notifying
  6. Informing
  7. LogicTestRegistration
  8. TestSuite
  9. TestSuite
  10. Suite
  11. Suite
  12. Serializable
  13. Serializable
  14. Assertions
  15. TripleEquals
  16. TripleEqualsSupport
  17. AnyRef
  18. Any
  1. Hide All
  2. Show All
Visibility
  1. Public
  2. All

Instance Constructors

  1. new LogicFunSuite()

    Permalink

Type Members

  1. class CheckingEqualizer[L] extends AnyRef

    Permalink
    Definition Classes
    TripleEqualsSupport
  2. class Equalizer[L] extends AnyRef

    Permalink
    Definition Classes
    TripleEqualsSupport
  3. abstract type FixtureParam

    Permalink

    The type of the fixture parameter that can be passed into tests in this suite.

    The type of the fixture parameter that can be passed into tests in this suite.

    Attributes
    protected
    Definition Classes
    Suite
  4. trait NoArgTest extends () ⇒ Outcome with TestData

    Permalink

    A test function taking no arguments and returning an Outcome.

    A test function taking no arguments and returning an Outcome.

    For more detail and examples, see the relevant section in the documentation for trait fixture.FlatSpec.

    Attributes
    protected
    Definition Classes
    TestSuite
  5. trait OneArgTest extends (FixtureParam) ⇒ Outcome with TestData

    Permalink

    A test function taking a fixture parameter and returning an Outcome.

    A test function taking a fixture parameter and returning an Outcome.

    For more detail and examples, see the documentation for trait fixture.FlatSpec.

    Attributes
    protected
    Definition Classes
    TestSuite
  6. class ResultOfIgnoreInvocation extends AnyRef

    Permalink
    Definition Classes
    LogicFunSuiteLike
  7. class ResultOfTestInvocation extends AnyRef

    Permalink
    Definition Classes
    LogicFunSuiteLike

Abstract Value Members

  1. abstract def withFixture(test: OneArgTest): Outcome

    Permalink

    Run the passed test function with a fixture created by this method.

    Run the passed test function with a fixture created by this method.

    This method should create the fixture object needed by the tests of the current suite, invoke the test function (passing in the fixture object), and if needed, perform any clean up needed after the test completes. For more detail and examples, see the main documentation for this trait.

    test

    the OneArgTest to invoke, passing in a fixture

    returns

    an instance of Outcome

    Attributes
    protected
    Definition Classes
    TestSuite

Concrete Value Members

  1. final def !=(arg0: Any): Boolean

    Permalink
    Definition Classes
    AnyRef → Any
  2. def !==[T](right: Spread[T]): TripleEqualsInvocationOnSpread[T]

    Permalink
    Definition Classes
    TripleEqualsSupport
  3. def !==(right: Null): TripleEqualsInvocation[Null]

    Permalink
    Definition Classes
    TripleEqualsSupport
  4. def !==[T](right: T): TripleEqualsInvocation[T]

    Permalink
    Definition Classes
    TripleEqualsSupport
  5. final def ##(): Int

    Permalink
    Definition Classes
    AnyRef → Any
  6. final def ==(arg0: Any): Boolean

    Permalink
    Definition Classes
    AnyRef → Any
  7. def ===[T](right: Spread[T]): TripleEqualsInvocationOnSpread[T]

    Permalink
    Definition Classes
    TripleEqualsSupport
  8. def ===(right: Null): TripleEqualsInvocation[Null]

    Permalink
    Definition Classes
    TripleEqualsSupport
  9. def ===[T](right: T): TripleEqualsInvocation[T]

    Permalink
    Definition Classes
    TripleEqualsSupport
  10. object OneArgTest

    Permalink

    Companion object for OneArgTest that provides factory method to create new OneArgTest instance by passing in a OneArgTest and a FixtureParam => Outcome function.

    Companion object for OneArgTest that provides factory method to create new OneArgTest instance by passing in a OneArgTest and a FixtureParam => Outcome function.

    Definition Classes
    TestSuite
  11. def alert: Alerter

    Permalink

    Returns an Alerter that during test execution will forward strings (and other objects) passed to its apply method to the current reporter.

    Returns an Alerter that during test execution will forward strings (and other objects) passed to its apply method to the current reporter. If invoked in a constructor, it will register the passed string for forwarding later during test execution. If invoked while this fixture.LogicFunSuite is being executed, such as from inside a test function, it will forward the information to the current reporter immediately. If invoked at any other time, it will print to the standard output. This method can be called safely by any thread.

    Attributes
    protected
    Definition Classes
    LogicFunSuiteLikeAlerting
  12. final def asInstanceOf[T0]: T0

    Permalink
    Definition Classes
    Any
  13. macro def assert(condition: Boolean, clue: Any)(implicit prettifier: Prettifier, pos: Position): Assertion

    Permalink

    Assert that a boolean condition, described in String message, is true.

    Assert that a boolean condition, described in String message, is true. If the condition is true, this method returns normally. Else, it throws TestFailedException with a helpful error message appended with the String obtained by invoking toString on the specified clue as the exception's detail message.

    This method is implemented in terms of a Scala macro that will generate a more helpful error message for expressions of this form:

    • assert(a == b, "a good clue")
    • assert(a != b, "a good clue")
    • assert(a === b, "a good clue")
    • assert(a !== b, "a good clue")
    • assert(a > b, "a good clue")
    • assert(a >= b, "a good clue")
    • assert(a < b, "a good clue")
    • assert(a <= b, "a good clue")
    • assert(a startsWith "prefix", "a good clue")
    • assert(a endsWith "postfix", "a good clue")
    • assert(a contains "something", "a good clue")
    • assert(a eq b, "a good clue")
    • assert(a ne b, "a good clue")
    • assert(a > 0 && b > 5, "a good clue")
    • assert(a > 0 || b > 5, "a good clue")
    • assert(a.isEmpty, "a good clue")
    • assert(!a.isEmpty, "a good clue")
    • assert(a.isInstanceOf[String], "a good clue")
    • assert(a.length == 8, "a good clue")
    • assert(a.size == 8, "a good clue")
    • assert(a.exists(_ == 8), "a good clue")

    At this time, any other form of expression will just get a TestFailedException with message saying the given expression was false. In the future, we will enhance this macro to give helpful error messages in more situations. In ScalaTest 2.0, however, this behavior was sufficient to allow the === that returns Boolean to be the default in tests. This makes === consistent between tests and production code.

    condition

    the boolean condition to assert

    clue

    An objects whose toString method returns a message to include in a failure report.

    Definition Classes
    Assertions
    Exceptions thrown

    NullArgumentException if message is null.

    TestFailedException if the condition is false.

  14. macro def assert(condition: Boolean)(implicit prettifier: Prettifier, pos: Position): Assertion

    Permalink

    Assert that a boolean condition is true.

    Assert that a boolean condition is true. If the condition is true, this method returns normally. Else, it throws TestFailedException.

    This method is implemented in terms of a Scala macro that will generate a more helpful error message for expressions of this form:

    • assert(a == b)
    • assert(a != b)
    • assert(a === b)
    • assert(a !== b)
    • assert(a > b)
    • assert(a >= b)
    • assert(a < b)
    • assert(a <= b)
    • assert(a startsWith "prefix")
    • assert(a endsWith "postfix")
    • assert(a contains "something")
    • assert(a eq b)
    • assert(a ne b)
    • assert(a > 0 && b > 5)
    • assert(a > 0 || b > 5)
    • assert(a.isEmpty)
    • assert(!a.isEmpty)
    • assert(a.isInstanceOf[String])
    • assert(a.length == 8)
    • assert(a.size == 8)
    • assert(a.exists(_ == 8))

    At this time, any other form of expression will get a TestFailedException with message saying the given expression was false. In the future, we will enhance this macro to give helpful error messages in more situations. In ScalaTest 2.0, however, this behavior was sufficient to allow the === that returns Boolean to be the default in tests. This makes === consistent between tests and production code.

    condition

    the boolean condition to assert

    Definition Classes
    Assertions
    Exceptions thrown

    TestFailedException if the condition is false.

  15. macro def assertCompiles(code: String)(implicit pos: Position): Assertion

    Permalink

    Asserts that a given string snippet of code passes both the Scala parser and type checker.

    Asserts that a given string snippet of code passes both the Scala parser and type checker.

    You can use this to make sure a snippet of code compiles:

    assertCompiles("val a: Int = 1")
    

    Although assertCompiles is implemented with a macro that determines at compile time whether the snippet of code represented by the passed string compiles, errors (i.e., snippets of code that do not compile) are reported as test failures at runtime.

    code

    the snippet of code that should compile

    Definition Classes
    Assertions
  16. macro def assertDoesNotCompile(code: String)(implicit pos: Position): Assertion

    Permalink

    Asserts that a given string snippet of code does not pass either the Scala parser or type checker.

    Asserts that a given string snippet of code does not pass either the Scala parser or type checker.

    Often when creating libraries you may wish to ensure that certain arrangements of code that represent potential “user errors” do not compile, so that your library is more error resistant. ScalaTest's Assertions trait includes the following syntax for that purpose:

    assertDoesNotCompile("val a: String = \"a string")
    

    Although assertDoesNotCompile is implemented with a macro that determines at compile time whether the snippet of code represented by the passed string doesn't compile, errors (i.e., snippets of code that do compile) are reported as test failures at runtime.

    Note that the difference between assertTypeError and assertDoesNotCompile is that assertDoesNotCompile will succeed if the given code does not compile for any reason, whereas assertTypeError will only succeed if the given code does not compile because of a type error. If the given code does not compile because of a syntax error, for example, assertDoesNotCompile will return normally but assertTypeError will throw a TestFailedException.

    code

    the snippet of code that should not type check

    Definition Classes
    Assertions
  17. def assertResult(expected: Any)(actual: Any)(implicit prettifier: Prettifier, pos: Position): Assertion

    Permalink

    Assert that the value passed as expected equals the value passed as actual.

    Assert that the value passed as expected equals the value passed as actual. If the actual value equals the expected value (as determined by ==), assertResult returns normally. Else, assertResult throws a TestFailedException whose detail message includes the expected and actual values.

    expected

    the expected value

    actual

    the actual value, which should equal the passed expected value

    Definition Classes
    Assertions
    Exceptions thrown

    TestFailedException if the passed actual value does not equal the passed expected value.

  18. def assertResult(expected: Any, clue: Any)(actual: Any)(implicit prettifier: Prettifier, pos: Position): Assertion

    Permalink

    Assert that the value passed as expected equals the value passed as actual.

    Assert that the value passed as expected equals the value passed as actual. If the actual equals the expected (as determined by ==), assertResult returns normally. Else, if actual is not equal to expected, assertResult throws a TestFailedException whose detail message includes the expected and actual values, as well as the String obtained by invoking toString on the passed clue.

    expected

    the expected value

    clue

    An object whose toString method returns a message to include in a failure report.

    actual

    the actual value, which should equal the passed expected value

    Definition Classes
    Assertions
    Exceptions thrown

    TestFailedException if the passed actual value does not equal the passed expected value.

  19. def assertThrows[T <: AnyRef](f: ⇒ Any)(implicit classTag: ClassTag[T], pos: Position): Assertion

    Permalink

    Ensure that an expected exception is thrown by the passed function value.

    Ensure that an expected exception is thrown by the passed function value. The thrown exception must be an instance of the type specified by the type parameter of this method. This method invokes the passed function. If the function throws an exception that's an instance of the specified type, this method returns Succeeded. Else, whether the passed function returns normally or completes abruptly with a different exception, this method throws TestFailedException.

    Note that the type specified as this method's type parameter may represent any subtype of AnyRef, not just Throwable or one of its subclasses. In Scala, exceptions can be caught based on traits they implement, so it may at times make sense to specify a trait that the intercepted exception's class must mix in. If a class instance is passed for a type that could not possibly be used to catch an exception (such as String, for example), this method will complete abruptly with a TestFailedException.

    Also note that the difference between this method and intercept is that this method does not return the expected exception, so it does not let you perform further assertions on that exception. Instead, this method returns Succeeded, which means it can serve as the last statement in an async- or safe-style suite. It also indicates to the reader of the code that nothing further is expected about the thrown exception other than its type. The recommended usage is to use assertThrows by default, intercept only when you need to inspect the caught exception further.

    f

    the function value that should throw the expected exception

    classTag

    an implicit ClassTag representing the type of the specified type parameter.

    returns

    the Succeeded singleton, if an exception of the expected type is thrown

    Definition Classes
    Assertions
    Exceptions thrown

    TestFailedException if the passed function does not complete abruptly with an exception that's an instance of the specified type.

  20. macro def assertTypeError(code: String)(implicit pos: Position): Assertion

    Permalink

    Asserts that a given string snippet of code does not pass the Scala type checker, failing if the given snippet does not pass the Scala parser.

    Asserts that a given string snippet of code does not pass the Scala type checker, failing if the given snippet does not pass the Scala parser.

    Often when creating libraries you may wish to ensure that certain arrangements of code that represent potential “user errors” do not compile, so that your library is more error resistant. ScalaTest's Assertions trait includes the following syntax for that purpose:

    assertTypeError("val a: String = 1")
    

    Although assertTypeError is implemented with a macro that determines at compile time whether the snippet of code represented by the passed string type checks, errors (i.e., snippets of code that do type check) are reported as test failures at runtime.

    Note that the difference between assertTypeError and assertDoesNotCompile is that assertDoesNotCompile will succeed if the given code does not compile for any reason, whereas assertTypeError will only succeed if the given code does not compile because of a type error. If the given code does not compile because of a syntax error, for example, assertDoesNotCompile will return normally but assertTypeError will throw a TestFailedException.

    code

    the snippet of code that should not type check

    Definition Classes
    Assertions
  21. macro def assume(condition: Boolean, clue: Any)(implicit prettifier: Prettifier, pos: Position): Assertion

    Permalink

    Assume that a boolean condition, described in String message, is true.

    Assume that a boolean condition, described in String message, is true. If the condition is true, this method returns normally. Else, it throws TestCanceledException with a helpful error message appended with String obtained by invoking toString on the specified clue as the exception's detail message.

    This method is implemented in terms of a Scala macro that will generate a more helpful error message for expressions of this form:

    • assume(a == b, "a good clue")
    • assume(a != b, "a good clue")
    • assume(a === b, "a good clue")
    • assume(a !== b, "a good clue")
    • assume(a > b, "a good clue")
    • assume(a >= b, "a good clue")
    • assume(a < b, "a good clue")
    • assume(a <= b, "a good clue")
    • assume(a startsWith "prefix", "a good clue")
    • assume(a endsWith "postfix", "a good clue")
    • assume(a contains "something", "a good clue")
    • assume(a eq b, "a good clue")
    • assume(a ne b, "a good clue")
    • assume(a > 0 && b > 5, "a good clue")
    • assume(a > 0 || b > 5, "a good clue")
    • assume(a.isEmpty, "a good clue")
    • assume(!a.isEmpty, "a good clue")
    • assume(a.isInstanceOf[String], "a good clue")
    • assume(a.length == 8, "a good clue")
    • assume(a.size == 8, "a good clue")
    • assume(a.exists(_ == 8), "a good clue")

    At this time, any other form of expression will just get a TestCanceledException with message saying the given expression was false. In the future, we will enhance this macro to give helpful error messages in more situations. In ScalaTest 2.0, however, this behavior was sufficient to allow the === that returns Boolean to be the default in tests. This makes === consistent between tests and production code.

    condition

    the boolean condition to assume

    clue

    An objects whose toString method returns a message to include in a failure report.

    Definition Classes
    Assertions
    Exceptions thrown

    NullArgumentException if message is null.

    TestCanceledException if the condition is false.

  22. macro def assume(condition: Boolean)(implicit prettifier: Prettifier, pos: Position): Assertion

    Permalink

    Assume that a boolean condition is true.

    Assume that a boolean condition is true. If the condition is true, this method returns normally. Else, it throws TestCanceledException.

    This method is implemented in terms of a Scala macro that will generate a more helpful error message for expressions of this form:

    • assume(a == b)
    • assume(a != b)
    • assume(a === b)
    • assume(a !== b)
    • assume(a > b)
    • assume(a >= b)
    • assume(a < b)
    • assume(a <= b)
    • assume(a startsWith "prefix")
    • assume(a endsWith "postfix")
    • assume(a contains "something")
    • assume(a eq b)
    • assume(a ne b)
    • assume(a > 0 && b > 5)
    • assume(a > 0 || b > 5)
    • assume(a.isEmpty)
    • assume(!a.isEmpty)
    • assume(a.isInstanceOf[String])
    • assume(a.length == 8)
    • assume(a.size == 8)
    • assume(a.exists(_ == 8))

    At this time, any other form of expression will just get a TestCanceledException with message saying the given expression was false. In the future, we will enhance this macro to give helpful error messages in more situations. In ScalaTest 2.0, however, this behavior was sufficient to allow the === that returns Boolean to be the default in tests. This makes === consistent between tests and production code.

    condition

    the boolean condition to assume

    Definition Classes
    Assertions
    Exceptions thrown

    TestCanceledException if the condition is false.

  23. def cancel(cause: Throwable)(implicit pos: Position): Nothing

    Permalink

    Throws TestCanceledException, with the passed Throwable cause, to indicate a test failed.

    Throws TestCanceledException, with the passed Throwable cause, to indicate a test failed. The getMessage method of the thrown TestCanceledException will return cause.toString.

    cause

    a Throwable that indicates the cause of the cancellation.

    Definition Classes
    Assertions
    Exceptions thrown

    NullArgumentException if cause is null

  24. def cancel(message: String, cause: Throwable)(implicit pos: Position): Nothing

    Permalink

    Throws TestCanceledException, with the passed String message as the exception's detail message and Throwable cause, to indicate a test failed.

    Throws TestCanceledException, with the passed String message as the exception's detail message and Throwable cause, to indicate a test failed.

    message

    A message describing the failure.

    cause

    A Throwable that indicates the cause of the failure.

    Definition Classes
    Assertions
    Exceptions thrown

    NullArgumentException if message or cause is null

  25. def cancel(message: String)(implicit pos: Position): Nothing

    Permalink

    Throws TestCanceledException, with the passed String message as the exception's detail message, to indicate a test was canceled.

    Throws TestCanceledException, with the passed String message as the exception's detail message, to indicate a test was canceled.

    message

    A message describing the cancellation.

    Definition Classes
    Assertions
    Exceptions thrown

    NullArgumentException if message is null

  26. def cancel()(implicit pos: Position): Nothing

    Permalink

    Throws TestCanceledException to indicate a test was canceled.

    Throws TestCanceledException to indicate a test was canceled.

    Definition Classes
    Assertions
  27. def clone(): AnyRef

    Permalink
    Attributes
    protected[java.lang]
    Definition Classes
    AnyRef
    Annotations
    @throws( ... )
  28. def conversionCheckedConstraint[A, B](implicit equivalenceOfA: Equivalence[A], cnv: (B) ⇒ A): CanEqual[A, B]

    Permalink
    Definition Classes
    TripleEquals → TripleEqualsSupport
  29. def convertEquivalenceToAToBConstraint[A, B](equivalenceOfB: Equivalence[B])(implicit ev: <:<[A, B]): CanEqual[A, B]

    Permalink
    Definition Classes
    TripleEquals → TripleEqualsSupport
  30. def convertEquivalenceToAToBConversionConstraint[A, B](equivalenceOfB: Equivalence[B])(implicit ev: (A) ⇒ B): CanEqual[A, B]

    Permalink
    Definition Classes
    TripleEquals → TripleEqualsSupport
  31. def convertEquivalenceToBToAConstraint[A, B](equivalenceOfA: Equivalence[A])(implicit ev: <:<[B, A]): CanEqual[A, B]

    Permalink
    Definition Classes
    TripleEquals → TripleEqualsSupport
  32. def convertEquivalenceToBToAConversionConstraint[A, B](equivalenceOfA: Equivalence[A])(implicit ev: (B) ⇒ A): CanEqual[A, B]

    Permalink
    Definition Classes
    TripleEquals → TripleEqualsSupport
  33. implicit def convertPendingToFixtureFunction(f: ⇒ PendingStatement): (FixtureParam) ⇒ Assertion

    Permalink

    Implicitly converts a function that takes no parameters and results in PendingStatement to a function from FixtureParam to Any, to enable pending tests to registered as by-name parameters by methods that require a test function that takes a FixtureParam.

    Implicitly converts a function that takes no parameters and results in PendingStatement to a function from FixtureParam to Any, to enable pending tests to registered as by-name parameters by methods that require a test function that takes a FixtureParam.

    This method makes it possible to write pending tests as simply (pending), without needing to write (fixture => pending).

    f

    a function

    returns

    a function of FixtureParam => Any

    Attributes
    protected
    Definition Classes
    LogicFunSuiteLike
  34. def convertToCheckingEqualizer[T](left: T): CheckingEqualizer[T]

    Permalink
    Definition Classes
    TripleEquals → TripleEqualsSupport
  35. implicit def convertToEqualizer[T](left: T): Equalizer[T]

    Permalink
    Definition Classes
    TripleEquals → TripleEqualsSupport
  36. def defaultEquality[A]: Equality[A]

    Permalink
    Definition Classes
    TripleEqualsSupport
  37. final def eq(arg0: AnyRef): Boolean

    Permalink
    Definition Classes
    AnyRef
  38. def equals(arg0: Any): Boolean

    Permalink
    Definition Classes
    AnyRef → Any
  39. def expectedTestCount(filter: Filter): Int

    Permalink

    The total number of tests that are expected to run when this Suite's run method is invoked.

    The total number of tests that are expected to run when this Suite's run method is invoked.

    This trait's implementation of this method returns the sum of:

    • the size of the testNames List, minus the number of tests marked as ignored and any tests that are exluded by the passed Filter
    • the sum of the values obtained by invoking expectedTestCount on every nested Suite contained in nestedSuites
    filter

    a Filter with which to filter tests to count based on their tags

    Definition Classes
    Suite
  40. def fail(cause: Throwable)(implicit pos: Position): Nothing

    Permalink

    Throws TestFailedException, with the passed Throwable cause, to indicate a test failed.

    Throws TestFailedException, with the passed Throwable cause, to indicate a test failed. The getMessage method of the thrown TestFailedException will return cause.toString.

    cause

    a Throwable that indicates the cause of the failure.

    Definition Classes
    Assertions
    Exceptions thrown

    NullArgumentException if cause is null

  41. def fail(message: String, cause: Throwable)(implicit pos: Position): Nothing

    Permalink

    Throws TestFailedException, with the passed String message as the exception's detail message and Throwable cause, to indicate a test failed.

    Throws TestFailedException, with the passed String message as the exception's detail message and Throwable cause, to indicate a test failed.

    message

    A message describing the failure.

    cause

    A Throwable that indicates the cause of the failure.

    Definition Classes
    Assertions
    Exceptions thrown

    NullArgumentException if message or cause is null

  42. def fail(message: String)(implicit pos: Position): Nothing

    Permalink

    Throws TestFailedException, with the passed String message as the exception's detail message, to indicate a test failed.

    Throws TestFailedException, with the passed String message as the exception's detail message, to indicate a test failed.

    message

    A message describing the failure.

    Definition Classes
    Assertions
    Exceptions thrown

    NullArgumentException if message is null

  43. def fail()(implicit pos: Position): Nothing

    Permalink

    Throws TestFailedException to indicate a test failed.

    Throws TestFailedException to indicate a test failed.

    Definition Classes
    Assertions
  44. def finalize(): Unit

    Permalink
    Attributes
    protected[java.lang]
    Definition Classes
    AnyRef
    Annotations
    @throws( classOf[java.lang.Throwable] )
  45. final def getClass(): Class[_]

    Permalink
    Definition Classes
    AnyRef → Any
  46. def hashCode(): Int

    Permalink
    Definition Classes
    AnyRef → Any
  47. def ignore(testName: String, testTags: Tag*): ResultOfIgnoreInvocation

    Permalink

    Register a test to ignore, which has the specified name, optional tags, and function value that takes no arguments.

    Register a test to ignore, which has the specified name, optional tags, and function value that takes no arguments. This method will register the test for later ignoring via an invocation of one of the run methods. This method exists to make it easy to ignore an existing test by changing the call to test to ignore without deleting or commenting out the actual test code. The test will not be run, but a report will be sent that indicates the test was ignored. The passed test name must not have been registered previously on this LogicFunSuite instance.

    testName

    the name of the test

    testTags

    the optional list of tags for this test

    Attributes
    protected
    Definition Classes
    LogicFunSuiteLike
    Exceptions thrown

    DuplicateTestNameException if a test with the same name has been registered previously

    NotAllowedException if testName had been registered previously

    TestRegistrationClosedException if invoked after run has been invoked on this suite

  48. def info: Informer

    Permalink

    Returns an Informer that during test execution will forward strings passed to its apply method to the current reporter.

    Returns an Informer that during test execution will forward strings passed to its apply method to the current reporter. If invoked in a constructor, it will register the passed string for forwarding later during test execution. If invoked from inside a scope, it will forward the information to the current reporter immediately. If invoked from inside a test function, it will record the information and forward it to the current reporter only after the test completed, as recordedEvents of the test completed event, such as TestSucceeded. If invoked at any other time, it will print to the standard output. This method can be called safely by any thread.

    Attributes
    protected
    Definition Classes
    LogicFunSuiteLikeInforming
  49. def intercept[T <: AnyRef](f: ⇒ Any)(implicit classTag: ClassTag[T], pos: Position): T

    Permalink

    Intercept and return an exception that's expected to be thrown by the passed function value.

    Intercept and return an exception that's expected to be thrown by the passed function value. The thrown exception must be an instance of the type specified by the type parameter of this method. This method invokes the passed function. If the function throws an exception that's an instance of the specified type, this method returns that exception. Else, whether the passed function returns normally or completes abruptly with a different exception, this method throws TestFailedException.

    Note that the type specified as this method's type parameter may represent any subtype of AnyRef, not just Throwable or one of its subclasses. In Scala, exceptions can be caught based on traits they implement, so it may at times make sense to specify a trait that the intercepted exception's class must mix in. If a class instance is passed for a type that could not possibly be used to catch an exception (such as String, for example), this method will complete abruptly with a TestFailedException.

    Also note that the difference between this method and assertThrows is that this method returns the expected exception, so it lets you perform further assertions on that exception. By contrast, the assertThrows method returns Succeeded, which means it can serve as the last statement in an async- or safe-style suite. assertThrows also indicates to the reader of the code that nothing further is expected about the thrown exception other than its type. The recommended usage is to use assertThrows by default, intercept only when you need to inspect the caught exception further.

    f

    the function value that should throw the expected exception

    classTag

    an implicit ClassTag representing the type of the specified type parameter.

    returns

    the intercepted exception, if it is of the expected type

    Definition Classes
    Assertions
    Exceptions thrown

    TestFailedException if the passed function does not complete abruptly with an exception that's an instance of the specified type.

  50. final def isInstanceOf[T0]: Boolean

    Permalink
    Definition Classes
    Any
  51. def lowPriorityConversionCheckedConstraint[A, B](implicit equivalenceOfB: Equivalence[B], cnv: (A) ⇒ B): CanEqual[A, B]

    Permalink
    Definition Classes
    TripleEquals → TripleEqualsSupport
  52. def lowPriorityTypeCheckedConstraint[A, B](implicit equivalenceOfB: Equivalence[B], ev: <:<[A, B]): CanEqual[A, B]

    Permalink
    Definition Classes
    TripleEquals → TripleEqualsSupport
  53. def markup: Documenter

    Permalink

    Returns a Documenter that during test execution will forward strings passed to its apply method to the current reporter.

    Returns a Documenter that during test execution will forward strings passed to its apply method to the current reporter. If invoked in a constructor, it will register the passed string for forwarding later during test execution. If invoked from inside a scope, it will forward the information to the current reporter immediately. If invoked from inside a test function, it will record the information and forward it to the current reporter only after the test completed, as recordedEvents of the test completed event, such as TestSucceeded. If invoked at any other time, it will print to the standard output. This method can be called safely by any thread.

    Attributes
    protected
    Definition Classes
    LogicFunSuiteLikeDocumenting
  54. final def ne(arg0: AnyRef): Boolean

    Permalink
    Definition Classes
    AnyRef
  55. def nestedSuites: IndexedSeq[scalatest.Suite]

    Permalink

    An immutable IndexedSeq of this Suite object's nested Suites.

    An immutable IndexedSeq of this Suite object's nested Suites. If this Suite contains no nested Suites, this method returns an empty IndexedSeq. This trait's implementation of this method returns an empty List.

    Definition Classes
    Suite
  56. def note: Notifier

    Permalink

    Returns a Notifier that during test execution will forward strings (and other objects) passed to its apply method to the current reporter.

    Returns a Notifier that during test execution will forward strings (and other objects) passed to its apply method to the current reporter. If invoked in a constructor, it will register the passed string for forwarding later during test execution. If invoked while this fixture.LogicFunSuite is being executed, such as from inside a test function, it will forward the information to the current reporter immediately. If invoked at any other time, it will print to the standard output. This method can be called safely by any thread.

    Attributes
    protected
    Definition Classes
    LogicFunSuiteLikeNotifying
  57. final def notify(): Unit

    Permalink
    Definition Classes
    AnyRef
  58. final def notifyAll(): Unit

    Permalink
    Definition Classes
    AnyRef
  59. def pending: Assertion with PendingStatement

    Permalink

    Throws TestPendingException to indicate a test is pending.

    Throws TestPendingException to indicate a test is pending.

    A pending test is one that has been given a name but is not yet implemented. The purpose of pending tests is to facilitate a style of testing in which documentation of behavior is sketched out before tests are written to verify that behavior (and often, the before the behavior of the system being tested is itself implemented). Such sketches form a kind of specification of what tests and functionality to implement later.

    To support this style of testing, a test can be given a name that specifies one bit of behavior required by the system being tested. The test can also include some code that sends more information about the behavior to the reporter when the tests run. At the end of the test, it can call method pending, which will cause it to complete abruptly with TestPendingException. Because tests in ScalaTest can be designated as pending with TestPendingException, both the test name and any information sent to the reporter when running the test can appear in the report of a test run. (In other words, the code of a pending test is executed just like any other test.) However, because the test completes abruptly with TestPendingException, the test will be reported as pending, to indicate the actual test, and possibly the functionality it is intended to test, has not yet been implemented.

    Note: This method always completes abruptly with a TestPendingException. Thus it always has a side effect. Methods with side effects are usually invoked with parentheses, as in pending(). This method is defined as a parameterless method, in flagrant contradiction to recommended Scala style, because it forms a kind of DSL for pending tests. It enables tests in suites such as FunSuite or FunSpec to be denoted by placing "(pending)" after the test name, as in:

    test("that style rules are not laws") (pending)
    

    Readers of the code see "pending" in parentheses, which looks like a little note attached to the test name to indicate it is pending. Whereas "(pending()) looks more like a method call, "(pending)" lets readers stay at a higher level, forgetting how it is implemented and just focusing on the intent of the programmer who wrote the code.

    Definition Classes
    Assertions
  60. def pendingUntilFixed(f: ⇒ Unit)(implicit pos: Position): Assertion with PendingStatement

    Permalink

    Execute the passed block of code, and if it completes abruptly, throw TestPendingException, else throw TestFailedException.

    Execute the passed block of code, and if it completes abruptly, throw TestPendingException, else throw TestFailedException.

    This method can be used to temporarily change a failing test into a pending test in such a way that it will automatically turn back into a failing test once the problem originally causing the test to fail has been fixed. At that point, you need only remove the pendingUntilFixed call. In other words, a pendingUntilFixed surrounding a block of code that isn't broken is treated as a test failure. The motivation for this behavior is to encourage people to remove pendingUntilFixed calls when there are no longer needed.

    This method facilitates a style of testing in which tests are written before the code they test. Sometimes you may encounter a test failure that requires more functionality than you want to tackle without writing more tests. In this case you can mark the bit of test code causing the failure with pendingUntilFixed. You can then write more tests and functionality that eventually will get your production code to a point where the original test won't fail anymore. At this point the code block marked with pendingUntilFixed will no longer throw an exception (because the problem has been fixed). This will in turn cause pendingUntilFixed to throw TestFailedException with a detail message explaining you need to go back and remove the pendingUntilFixed call as the problem orginally causing your test code to fail has been fixed.

    f

    a block of code, which if it completes abruptly, should trigger a TestPendingException

    Definition Classes
    Assertions
    Exceptions thrown

    TestPendingException if the passed block of code completes abruptly with an Exception or AssertionError

  61. final def registerIgnoredTest(testText: String, testTags: Tag*)(testFun: (FixtureParam) ⇒ Assertion)(implicit pos: Position): Unit

    Permalink

    Registers an ignored test.

    Registers an ignored test.

    testText

    the test text

    testTags

    the test tags

    testFun

    the test function

    Definition Classes
    LogicFunSuiteLikeLogicTestRegistration
  62. final def registerTest(testText: String, testTags: Tag*)(testFun: (FixtureParam) ⇒ Assertion)(implicit pos: Position): Unit

    Permalink

    Registers a test.

    Registers a test.

    testText

    the test text

    testTags

    the test tags

    testFun

    the test function

    Definition Classes
    LogicFunSuiteLikeLogicTestRegistration
  63. def rerunner: Option[String]

    Permalink

    The fully qualified class name of the rerunner to rerun this suite.

    The fully qualified class name of the rerunner to rerun this suite. This implementation will look at this.getClass and see if it is either an accessible Suite, or it has a WrapWith annotation. If so, it returns the fully qualified class name wrapped in a Some, or else it returns None.

    Definition Classes
    Suite
  64. def run(testName: Option[String], args: Args): Status

    Permalink

    Runs this suite of tests.

    Runs this suite of tests.

    If testName is None, this trait's implementation of this method calls these two methods on this object in this order:

    • runNestedSuites
    • runTests

    If testName is defined, then this trait's implementation of this method calls runTests, but does not call runNestedSuites. This behavior is part of the contract of this method. Subclasses that override run must take care not to call runNestedSuites if testName is defined. (The OneInstancePerTest trait depends on this behavior, for example.)

    Subclasses and subtraits that override this run method can implement them without invoking either the runTests or runNestedSuites methods, which are invoked by this trait's implementation of this method. It is recommended, but not required, that subclasses and subtraits that override run in a way that does not invoke runNestedSuites also override runNestedSuites and make it final. Similarly it is recommended, but not required, that subclasses and subtraits that override run in a way that does not invoke runTests also override runTests (and runTest, which this trait's implementation of runTests calls) and make it final. The implementation of these final methods can either invoke the superclass implementation of the method, or throw an UnsupportedOperationException if appropriate. The reason for this recommendation is that ScalaTest includes several traits that override these methods to allow behavior to be mixed into a Suite. For example, trait BeforeAndAfterEach overrides runTestss. In a Suite subclass that no longer invokes runTests from run, the BeforeAndAfterEach trait is not applicable. Mixing it in would have no effect. By making runTests final in such a Suite subtrait, you make the attempt to mix BeforeAndAfterEach into a subclass of your subtrait a compiler error. (It would fail to compile with a complaint that BeforeAndAfterEach is trying to override runTests, which is a final method in your trait.)

    testName

    an optional name of one test to run. If None, all relevant tests should be run. I.e., None acts like a wildcard that means run all relevant tests in this Suite.

    args

    the Args for this run

    returns

    a Status object that indicates when all tests and nested suites started by this method have completed, and whether or not a failure occurred.

    Definition Classes
    LogicFunSuiteLikeSuite
    Exceptions thrown

    IllegalArgumentException if testName is defined, but no test with the specified test name exists in this Suite

    NullArgumentException if any passed parameter is null.

  65. def runNestedSuites(args: Args): Status

    Permalink

    Run zero to many of this Suite's nested Suites.

    Run zero to many of this Suite's nested Suites.

    If the passed distributor is None, this trait's implementation of this method invokes run on each nested Suite in the List obtained by invoking nestedSuites. If a nested Suite's run method completes abruptly with an exception, this trait's implementation of this method reports that the Suite aborted and attempts to run the next nested Suite. If the passed distributor is defined, this trait's implementation puts each nested Suite into the Distributor contained in the Some, in the order in which the Suites appear in the List returned by nestedSuites, passing in a new Tracker obtained by invoking nextTracker on the Tracker passed to this method.

    Implementations of this method are responsible for ensuring SuiteStarting events are fired to the Reporter before executing any nested Suite, and either SuiteCompleted or SuiteAborted after executing any nested Suite.

    args

    the Args for this run

    returns

    a Status object that indicates when all nested suites started by this method have completed, and whether or not a failure occurred.

    Attributes
    protected
    Definition Classes
    Suite
    Exceptions thrown

    NullArgumentException if any passed parameter is null.

  66. def runTest(testName: String, args: Args): Status

    Permalink

    Run a test.

    Run a test. This trait's implementation runs the test registered with the name specified by testName.

    testName

    the name of one test to run.

    args

    the Args for this run

    returns

    a Status object that indicates when the test started by this method has completed, and whether or not it failed .

    Attributes
    protected
    Definition Classes
    LogicFunSuiteLikeTestSuiteSuite
    Exceptions thrown

    IllegalArgumentException if testName is defined but a test with that name does not exist on this fixture.LogicFunSuite

    NullArgumentException if testName or args is null.

  67. def runTests(testName: Option[String], args: Args): Status

    Permalink

    Run zero to many of this fixture.LogicFunSuiteLike's tests.

    Run zero to many of this fixture.LogicFunSuiteLike's tests.

    This method takes a testName parameter that optionally specifies a test to invoke. If testName is Some, this trait's implementation of this method invokes runTest on this object with passed args.

    This method takes an args that contains a Set of tag names that should be included (tagsToInclude), and a Set that should be excluded (tagsToExclude), when deciding which of this Suite's tests to execute. If tagsToInclude is empty, all tests will be executed except those those belonging to tags listed in the tagsToExclude Set. If tagsToInclude is non-empty, only tests belonging to tags mentioned in tagsToInclude, and not mentioned in tagsToExclude will be executed. However, if testName is Some, tagsToInclude and tagsToExclude are essentially ignored. Only if testName is None will tagsToInclude and tagsToExclude be consulted to determine which of the tests named in the testNames Set should be run. For more information on trait tags, see the main documentation for this trait.

    If testName is None, this trait's implementation of this method invokes testNames on this Suite to get a Set of names of tests to potentially execute. (A testNames value of None essentially acts as a wildcard that means all tests in this Suite that are selected by tagsToInclude and tagsToExclude should be executed.) For each test in the testName Set, in the order they appear in the iterator obtained by invoking the elements method on the Set, this trait's implementation of this method checks whether the test should be run based on the tagsToInclude and tagsToExclude Sets. If so, this implementation invokes runTest with passed args.

    testName

    an optional name of one test to execute. If None, all relevant tests should be executed. I.e., None acts like a wildcard that means execute all relevant tests in this FunSpec.

    args

    the Args to which results will be reported

    returns

    a Status object that indicates when all tests started by this method have completed, and whether or not a failure occurred.

    Attributes
    protected
    Definition Classes
    LogicFunSuiteLikeSuite
    Exceptions thrown

    NullArgumentException if any of testName or args is null.

  68. final val styleName: String

    Permalink

    Suite style name.

    Suite style name.

    returns

    org.scalatest.fixture.LogicFunSuite

    Definition Classes
    LogicFunSuiteLikeSuiteSuite
  69. final val succeed: Assertion

    Permalink

    The Succeeded singleton.

    The Succeeded singleton.

    You can use succeed to solve a type error when an async test does not end in either Future[Assertion] or Assertion. Because Assertion is a type alias for Succeeded.type, putting succeed at the end of a test body (or at the end of a function being used to map the final future of a test body) will solve the type error.

    Definition Classes
    Assertions
  70. def suiteId: String

    Permalink

    A string ID for this Suite that is intended to be unique among all suites reported during a run.

    A string ID for this Suite that is intended to be unique among all suites reported during a run.

    This trait's implementation of this method returns the fully qualified name of this object's class. Each suite reported during a run will commonly be an instance of a different Suite class, and in such cases, this default implementation of this method will suffice. However, in special cases you may need to override this method to ensure it is unique for each reported suite. For example, if you write a Suite subclass that reads in a file whose name is passed to its constructor and dynamically creates a suite of tests based on the information in that file, you will likely need to override this method in your Suite subclass, perhaps by appending the pathname of the file to the fully qualified class name. That way if you run a suite of tests based on a directory full of these files, you'll have unique suite IDs for each reported suite.

    The suite ID is intended to be unique, because ScalaTest does not enforce that it is unique. If it is not unique, then you may not be able to uniquely identify a particular test of a particular suite. This ability is used, for example, to dynamically tag tests as having failed in the previous run when rerunning only failed tests.

    returns

    this Suite object's ID.

    Definition Classes
    Suite
  71. def suiteName: String

    Permalink

    A user-friendly suite name for this Suite.

    A user-friendly suite name for this Suite.

    This trait's implementation of this method returns the simple name of this object's class. This trait's implementation of runNestedSuites calls this method to obtain a name for Reports to pass to the suiteStarting, suiteCompleted, and suiteAborted methods of the Reporter.

    returns

    this Suite object's suite name.

    Definition Classes
    Suite
  72. final def synchronized[T0](arg0: ⇒ T0): T0

    Permalink
    Definition Classes
    AnyRef
  73. def tags: Map[String, Set[String]]

    Permalink

    A Map whose keys are String tag names to which tests in this fixture.LogicFunSuite belong, and values the Set of test names that belong to each tag.

    A Map whose keys are String tag names to which tests in this fixture.LogicFunSuite belong, and values the Set of test names that belong to each tag. If this fixture.LogicFunSuite contains no tags, this method returns an empty Map.

    This trait's implementation returns tags that were passed as strings contained in Tag objects passed to methods test and ignore.

    In addition, this trait's implementation will also auto-tag tests with class level annotations. For example, if you annotate @Ignore at the class level, all test methods in the class will be auto-annotated with @Ignore.

    Definition Classes
    LogicFunSuiteLikeSuite
  74. def test(testName: String, testTags: Tag*): ResultOfTestInvocation

    Permalink

    Register a test with the specified name, optional tags, and function value that takes no arguments.

    Register a test with the specified name, optional tags, and function value that takes no arguments. This method will register the test for later execution via an invocation of one of the run methods. The passed test name must not have been registered previously on this LogicFunSuite instance.

    testName

    the name of the test

    testTags

    the optional list of tags for this test

    Attributes
    protected
    Definition Classes
    LogicFunSuiteLike
    Exceptions thrown

    DuplicateTestNameException if a test with the same name has been registered previously

    NotAllowedException if testName had been registered previously

    NullArgumentException if testName or any passed test tag is null

    TestRegistrationClosedException if invoked after run has been invoked on this suite

  75. def testDataFor(testName: String, theConfigMap: ConfigMap = ConfigMap.empty): TestData

    Permalink

    Provides a TestData instance for the passed test name, given the passed config map.

    Provides a TestData instance for the passed test name, given the passed config map.

    This method is used to obtain a TestData instance to pass to withFixture(NoArgTest) and withFixture(OneArgTest) and the beforeEach and afterEach methods of trait BeforeAndAfterEach.

    testName

    the name of the test for which to return a TestData instance

    theConfigMap

    the config map to include in the returned TestData

    returns

    a TestData instance for the specified test, which includes the specified config map

    Definition Classes
    LogicFunSuiteLikeSuite
  76. def testNames: Set[String]

    Permalink

    An immutable Set of test names.

    An immutable Set of test names. If this fixture.LogicFunSuite contains no tests, this method returns an empty Set.

    This trait's implementation of this method will return a set that contains the names of all registered tests. The set's iterator will return those names in the order in which the tests were registered.

    returns

    the Set of test names

    Definition Classes
    LogicFunSuiteLikeSuite
  77. def testsFor(unit: Unit): Unit

    Permalink

    Registers shared tests.

    Registers shared tests.

    This method enables the following syntax for shared tests in a fixture.LogicFunSuite:

    testsFor(nonEmptyStack(lastValuePushed))
    

    This method just provides syntax sugar intended to make the intent of the code clearer. Because the parameter passed to it is type Unit, the expression will be evaluated before being passed, which is sufficient to register the shared tests. For examples of shared tests, see the Shared tests section in the main documentation for trait LogicFunSuite.

    Attributes
    protected
    Definition Classes
    LogicFunSuiteLike
  78. def toString(): String

    Permalink

    Returns a user friendly string for this suite, composed of the simple name of the class (possibly simplified further by removing dollar signs if added by the Scala interpeter) and, if this suite contains nested suites, the result of invoking toString on each of the nested suites, separated by commas and surrounded by parentheses.

    Returns a user friendly string for this suite, composed of the simple name of the class (possibly simplified further by removing dollar signs if added by the Scala interpeter) and, if this suite contains nested suites, the result of invoking toString on each of the nested suites, separated by commas and surrounded by parentheses.

    returns

    a user-friendly string for this suite

    Definition Classes
    LogicFunSuite → AnyRef → Any
  79. def typeCheckedConstraint[A, B](implicit equivalenceOfA: Equivalence[A], ev: <:<[B, A]): CanEqual[A, B]

    Permalink
    Definition Classes
    TripleEquals → TripleEqualsSupport
  80. implicit def unconstrainedEquality[A, B](implicit equalityOfA: Equality[A]): CanEqual[A, B]

    Permalink
    Definition Classes
    TripleEquals → TripleEqualsSupport
  81. final def wait(): Unit

    Permalink
    Definition Classes
    AnyRef
    Annotations
    @throws( ... )
  82. final def wait(arg0: Long, arg1: Int): Unit

    Permalink
    Definition Classes
    AnyRef
    Annotations
    @throws( ... )
  83. final def wait(arg0: Long): Unit

    Permalink
    Definition Classes
    AnyRef
    Annotations
    @throws( ... )
  84. def withClue[T](clue: Any)(fun: ⇒ T): T

    Permalink

    Executes the block of code passed as the second parameter, and, if it completes abruptly with a ModifiableMessage exception, prepends the "clue" string passed as the first parameter to the beginning of the detail message of that thrown exception, then rethrows it.

    Executes the block of code passed as the second parameter, and, if it completes abruptly with a ModifiableMessage exception, prepends the "clue" string passed as the first parameter to the beginning of the detail message of that thrown exception, then rethrows it. If clue does not end in a white space character, one space will be added between it and the existing detail message (unless the detail message is not defined).

    This method allows you to add more information about what went wrong that will be reported when a test fails. Here's an example:

    withClue("(Employee's name was: " + employee.name + ")") {
      intercept[IllegalArgumentException] {
        employee.getTask(-1)
      }
    }
    

    If an invocation of intercept completed abruptly with an exception, the resulting message would be something like:

    (Employee's name was Bob Jones) Expected IllegalArgumentException to be thrown, but no exception was thrown
    

    Definition Classes
    Assertions
    Exceptions thrown

    NullArgumentException if the passed clue is null

  85. def withFixture(test: NoArgTest): Outcome

    Permalink

    Run the passed test function in the context of a fixture established by this method.

    Run the passed test function in the context of a fixture established by this method.

    This method should set up the fixture needed by the tests of the current suite, invoke the test function, and if needed, perform any clean up needed after the test completes. Because the NoArgTest function passed to this method takes no parameters, preparing the fixture will require side effects, such as reassigning instance vars in this Suite or initializing a globally accessible external database. If you want to avoid reassigning instance vars you can use fixture.Suite.

    This trait's implementation of runTest invokes this method for each test, passing in a NoArgTest whose apply method will execute the code of the test.

    This trait's implementation of this method simply invokes the passed NoArgTest function.

    test

    the no-arg test function to run with a fixture

    Attributes
    protected
    Definition Classes
    TestSuite

Deprecated Value Members

  1. def trap[T](f: ⇒ T): Throwable

    Permalink

    Trap and return any thrown exception that would normally cause a ScalaTest test to fail, or create and return a new RuntimeException indicating no exception is thrown.

    Trap and return any thrown exception that would normally cause a ScalaTest test to fail, or create and return a new RuntimeException indicating no exception is thrown.

    This method is intended to be used in the Scala interpreter to eliminate large stack traces when trying out ScalaTest assertions and matcher expressions. It is not intended to be used in regular test code. If you want to ensure that a bit of code throws an expected exception, use intercept, not trap. Here's an example interpreter session without trap:

    scala> import org.scalatest._
    import org.scalatest._
    
    scala> import Matchers._
    import Matchers._
    
    scala> val x = 12
    a: Int = 12
    
    scala> x shouldEqual 13
    org.scalatest.exceptions.TestFailedException: 12 did not equal 13
       at org.scalatest.Assertions$class.newAssertionFailedException(Assertions.scala:449)
       at org.scalatest.Assertions$.newAssertionFailedException(Assertions.scala:1203)
       at org.scalatest.Assertions$AssertionsHelper.macroAssertTrue(Assertions.scala:417)
       at .<init>(<console>:15)
       at .<clinit>(<console>)
       at .<init>(<console>:7)
       at .<clinit>(<console>)
       at $print(<console>)
       at sun.reflect.NativeMethodAccessorImpl.invoke0(Native Method)
       at sun.reflect.NativeMethodAccessorImpl.invoke(NativeMethodAccessorImpl.java:39)
       at sun.reflect.DelegatingMethodAccessorImpl.invoke(DelegatingMethodAccessorImpl.java:25)
       at java.lang.reflect.Method.invoke(Method.java:597)
       at scala.tools.nsc.interpreter.IMain$ReadEvalPrint.call(IMain.scala:731)
       at scala.tools.nsc.interpreter.IMain$Request.loadAndRun(IMain.scala:980)
       at scala.tools.nsc.interpreter.IMain.loadAndRunReq$1(IMain.scala:570)
       at scala.tools.nsc.interpreter.IMain.interpret(IMain.scala:601)
       at scala.tools.nsc.interpreter.IMain.interpret(IMain.scala:565)
       at scala.tools.nsc.interpreter.ILoop.reallyInterpret$1(ILoop.scala:745)
       at scala.tools.nsc.interpreter.ILoop.interpretStartingWith(ILoop.scala:790)
       at scala.tools.nsc.interpreter.ILoop.command(ILoop.scala:702)
       at scala.tools.nsc.interpreter.ILoop.processLine$1(ILoop.scala:566)
       at scala.tools.nsc.interpreter.ILoop.innerLoop$1(ILoop.scala:573)
       at scala.tools.nsc.interpreter.ILoop.loop(ILoop.scala:576)
       at scala.tools.nsc.interpreter.ILoop$$anonfun$process$1.apply$mcZ$sp(ILoop.scala:867)
       at scala.tools.nsc.interpreter.ILoop$$anonfun$process$1.apply(ILoop.scala:822)
       at scala.tools.nsc.interpreter.ILoop$$anonfun$process$1.apply(ILoop.scala:822)
       at scala.tools.nsc.util.ScalaClassLoader$.savingContextLoader(ScalaClassLoader.scala:135)
       at scala.tools.nsc.interpreter.ILoop.process(ILoop.scala:822)
       at scala.tools.nsc.MainGenericRunner.runTarget$1(MainGenericRunner.scala:83)
       at scala.tools.nsc.MainGenericRunner.process(MainGenericRunner.scala:96)
       at scala.tools.nsc.MainGenericRunner$.main(MainGenericRunner.scala:105)
       at scala.tools.nsc.MainGenericRunner.main(MainGenericRunner.scala)
    

    That's a pretty tall stack trace. Here's what it looks like when you use trap:

    scala> trap { x shouldEqual 13 }
    res1: Throwable = org.scalatest.exceptions.TestFailedException: 12 did not equal 13
    

    Much less clutter. Bear in mind, however, that if no exception is thrown by the passed block of code, the trap method will create a new NormalResult (a subclass of Throwable made for this purpose only) and return that. If the result was the Unit value, it will simply say that no exception was thrown:

    scala> trap { x shouldEqual 12 }
    res2: Throwable = No exception was thrown.
    

    If the passed block of code results in a value other than Unit, the NormalResult's toString will print the value:

    scala> trap { "Dude!" }
    res3: Throwable = No exception was thrown. Instead, result was: "Dude!"
    

    Although you can access the result value from the NormalResult, its type is Any and therefore not very convenient to use. It is not intended that trap be used in test code. The sole intended use case for trap is decluttering Scala interpreter sessions by eliminating stack traces when executing assertion and matcher expressions.

    Definition Classes
    Assertions
    Annotations
    @deprecated
    Deprecated

    The trap method is no longer needed for demos in the REPL, which now abreviates stack traces, and will be removed in a future version of ScalaTest

Inherited from LogicFunSuiteLike

Inherited from Documenting

Inherited from Alerting

Inherited from Notifying

Inherited from Informing

Inherited from LogicTestRegistration

Inherited from TestSuite

Inherited from scalatest.TestSuite

Inherited from Suite

Inherited from scalatest.Suite

Inherited from Serializable

Inherited from Serializable

Inherited from Assertions

Inherited from TripleEquals

Inherited from TripleEqualsSupport

Inherited from AnyRef

Inherited from Any

Ungrouped