Trait

org.scalatest.path

FreeSpecLike

Related Doc: package path

Permalink

trait FreeSpecLike extends Suite with OneInstancePerTest with Informing with Notifying with Alerting with Documenting

Implementation trait for class path.FreeSpec, which is a sister class to org.scalatest.FreeSpec that isolates tests by running each test in its own instance of the test class, and for each test, only executing the path leading to that test.

path.FreeSpec is a class, not a trait, to minimize compile time given there is a slight compiler overhead to mixing in traits compared to extending classes. If you need to mix the behavior of path.FreeSpec into some other class, you can use this trait instead, because class path.FreeSpec does nothing more than extend this trait and add a nice toString implementation.

See the documentation of the class for a detailed overview of path.FreeSpec.

Self Type
FreeSpecLike
Annotations
@Finders() @EnableReflectiveInstantiation()
Linear Supertypes
Documenting, Alerting, Notifying, Informing, OneInstancePerTest, SuiteMixin, Suite, Serializable, Serializable, Assertions, TripleEquals, TripleEqualsSupport, AnyRef, Any
Known Subclasses
Ordering
  1. Alphabetic
  2. By Inheritance
Inherited
  1. FreeSpecLike
  2. Documenting
  3. Alerting
  4. Notifying
  5. Informing
  6. OneInstancePerTest
  7. SuiteMixin
  8. Suite
  9. Serializable
  10. Serializable
  11. Assertions
  12. TripleEquals
  13. TripleEqualsSupport
  14. AnyRef
  15. Any
  1. Hide All
  2. Show All
Visibility
  1. Public
  2. All

Type Members

  1. class AssertionsHelper extends AnyRef

    Permalink

    Helper class used by code generated by the assert macro.

    Helper class used by code generated by the assert macro.

    Definition Classes
    Assertions
  2. class CheckingEqualizer[L] extends AnyRef

    Permalink
    Definition Classes
    TripleEqualsSupport
  3. class Equalizer[L] extends AnyRef

    Permalink
    Definition Classes
    TripleEqualsSupport
  4. final class FreeSpecStringWrapper extends AnyRef

    Permalink

    A class that via an implicit conversion (named convertToFreeSpecStringWrapper) enables methods in, is, taggedAs and ignore, as well as the dash operator (-), to be invoked on Strings.

    A class that via an implicit conversion (named convertToFreeSpecStringWrapper) enables methods in, is, taggedAs and ignore, as well as the dash operator (-), to be invoked on Strings.

    Attributes
    protected
  5. final class ResultOfTaggedAsInvocationOnString extends AnyRef

    Permalink

    Class that supports the registration of tagged tests.

    Class that supports the registration of tagged tests.

    Instances of this class are returned by the taggedAs method of class FreeSpecStringWrapper.

    Attributes
    protected

Abstract Value Members

  1. abstract def newInstance: FreeSpecLike

    Permalink

    Construct a new instance of this Suite.

    Construct a new instance of this Suite.

    This trait's implementation of runTests invokes this method to create a new instance of this Suite for each test. This trait's implementation of this method uses reflection to call this.getClass.newInstance. This approach will succeed only if this Suite's class has a public, no-arg constructor. In most cases this is likely to be true, because to be instantiated by ScalaTest's Runner a Suite needs a public, no-arg constructor. However, this will not be true of any Suite defined as an inner class of another class or trait, because every constructor of an inner class type takes a reference to the enclosing instance. In such cases, and in cases where a Suite class is explicitly defined without a public, no-arg constructor, you will need to override this method to construct a new instance of the Suite in some other way.

    Here's an example of how you could override newInstance to construct a new instance of an inner class:

    import org.scalatest.Suite
    
    class Outer {
      class InnerSuite extends Suite with OneInstancePerTest {
        def testOne() {}
        def testTwo() {}
        override def newInstance = new InnerSuite
      }
    }
    

    Definition Classes
    FreeSpecLikeOneInstancePerTest

Concrete Value Members

  1. final def !=(arg0: Any): Boolean

    Permalink
    Definition Classes
    AnyRef → Any
  2. def !==[T](right: Spread[T]): TripleEqualsInvocationOnSpread[T]

    Permalink
    Definition Classes
    TripleEqualsSupport
  3. def !==(right: Null): TripleEqualsInvocation[Null]

    Permalink
    Definition Classes
    TripleEqualsSupport
  4. def !==[T](right: T): TripleEqualsInvocation[T]

    Permalink
    Definition Classes
    TripleEqualsSupport
  5. final def ##(): Int

    Permalink
    Definition Classes
    AnyRef → Any
  6. final def ==(arg0: Any): Boolean

    Permalink
    Definition Classes
    AnyRef → Any
  7. def ===[T](right: Spread[T]): TripleEqualsInvocationOnSpread[T]

    Permalink
    Definition Classes
    TripleEqualsSupport
  8. def ===(right: Null): TripleEqualsInvocation[Null]

    Permalink
    Definition Classes
    TripleEqualsSupport
  9. def ===[T](right: T): TripleEqualsInvocation[T]

    Permalink
    Definition Classes
    TripleEqualsSupport
  10. def alert: Alerter

    Permalink

    Returns an Alerter that during test execution will forward strings passed to its apply method to the current reporter.

    Returns an Alerter that during test execution will forward strings passed to its apply method to the current reporter. If invoked in a constructor, it will register the passed string for forwarding later during test execution. If invoked while this path.FreeSpec is being executed, such as from inside a test function, it will forward the information to the current reporter immediately. If invoked at any other time, it will print to the standard output. This method can be called safely by any thread.

    Attributes
    protected
    Definition Classes
    FreeSpecLikeAlerting
  11. final def asInstanceOf[T0]: T0

    Permalink
    Definition Classes
    Any
  12. macro def assert(condition: Boolean, clue: Any)(implicit prettifier: Prettifier, pos: Position): Assertion

    Permalink

    Assert that a boolean condition, described in String message, is true.

    Assert that a boolean condition, described in String message, is true. If the condition is true, this method returns normally. Else, it throws TestFailedException with a helpful error message appended with the String obtained by invoking toString on the specified clue as the exception's detail message.

    This method is implemented in terms of a Scala macro that will generate a more helpful error message for expressions of this form:

    • assert(a == b, "a good clue")
    • assert(a != b, "a good clue")
    • assert(a === b, "a good clue")
    • assert(a !== b, "a good clue")
    • assert(a > b, "a good clue")
    • assert(a >= b, "a good clue")
    • assert(a < b, "a good clue")
    • assert(a <= b, "a good clue")
    • assert(a startsWith "prefix", "a good clue")
    • assert(a endsWith "postfix", "a good clue")
    • assert(a contains "something", "a good clue")
    • assert(a eq b, "a good clue")
    • assert(a ne b, "a good clue")
    • assert(a > 0 && b > 5, "a good clue")
    • assert(a > 0 || b > 5, "a good clue")
    • assert(a.isEmpty, "a good clue")
    • assert(!a.isEmpty, "a good clue")
    • assert(a.isInstanceOf[String], "a good clue")
    • assert(a.length == 8, "a good clue")
    • assert(a.size == 8, "a good clue")
    • assert(a.exists(_ == 8), "a good clue")

    At this time, any other form of expression will just get a TestFailedException with message saying the given expression was false. In the future, we will enhance this macro to give helpful error messages in more situations. In ScalaTest 2.0, however, this behavior was sufficient to allow the === that returns Boolean to be the default in tests. This makes === consistent between tests and production code.

    condition

    the boolean condition to assert

    clue

    An objects whose toString method returns a message to include in a failure report.

    Definition Classes
    Assertions
    Exceptions thrown

    NullArgumentException if message is null.

    TestFailedException if the condition is false.

  13. macro def assert(condition: Boolean)(implicit prettifier: Prettifier, pos: Position): Assertion

    Permalink

    Assert that a boolean condition is true.

    Assert that a boolean condition is true. If the condition is true, this method returns normally. Else, it throws TestFailedException.

    This method is implemented in terms of a Scala macro that will generate a more helpful error message for expressions of this form:

    • assert(a == b)
    • assert(a != b)
    • assert(a === b)
    • assert(a !== b)
    • assert(a > b)
    • assert(a >= b)
    • assert(a < b)
    • assert(a <= b)
    • assert(a startsWith "prefix")
    • assert(a endsWith "postfix")
    • assert(a contains "something")
    • assert(a eq b)
    • assert(a ne b)
    • assert(a > 0 && b > 5)
    • assert(a > 0 || b > 5)
    • assert(a.isEmpty)
    • assert(!a.isEmpty)
    • assert(a.isInstanceOf[String])
    • assert(a.length == 8)
    • assert(a.size == 8)
    • assert(a.exists(_ == 8))

    At this time, any other form of expression will get a TestFailedException with message saying the given expression was false. In the future, we will enhance this macro to give helpful error messages in more situations. In ScalaTest 2.0, however, this behavior was sufficient to allow the === that returns Boolean to be the default in tests. This makes === consistent between tests and production code.

    condition

    the boolean condition to assert

    Definition Classes
    Assertions
    Exceptions thrown

    TestFailedException if the condition is false.

  14. macro def assertCompiles(code: String)(implicit pos: Position): Assertion

    Permalink

    Asserts that a given string snippet of code passes both the Scala parser and type checker.

    Asserts that a given string snippet of code passes both the Scala parser and type checker.

    You can use this to make sure a snippet of code compiles:

    assertCompiles("val a: Int = 1")
    

    Although assertCompiles is implemented with a macro that determines at compile time whether the snippet of code represented by the passed string compiles, errors (i.e., snippets of code that do not compile) are reported as test failures at runtime.

    code

    the snippet of code that should compile

    Definition Classes
    Assertions
  15. macro def assertDoesNotCompile(code: String)(implicit pos: Position): Assertion

    Permalink

    Asserts that a given string snippet of code does not pass either the Scala parser or type checker.

    Asserts that a given string snippet of code does not pass either the Scala parser or type checker.

    Often when creating libraries you may wish to ensure that certain arrangements of code that represent potential “user errors” do not compile, so that your library is more error resistant. ScalaTest's Assertions trait includes the following syntax for that purpose:

    assertDoesNotCompile("val a: String = \"a string")
    

    Although assertDoesNotCompile is implemented with a macro that determines at compile time whether the snippet of code represented by the passed string doesn't compile, errors (i.e., snippets of code that do compile) are reported as test failures at runtime.

    Note that the difference between assertTypeError and assertDoesNotCompile is that assertDoesNotCompile will succeed if the given code does not compile for any reason, whereas assertTypeError will only succeed if the given code does not compile because of a type error. If the given code does not compile because of a syntax error, for example, assertDoesNotCompile will return normally but assertTypeError will throw a TestFailedException.

    code

    the snippet of code that should not type check

    Definition Classes
    Assertions
  16. def assertResult(expected: Any)(actual: Any)(implicit prettifier: Prettifier, pos: Position): Assertion

    Permalink

    Assert that the value passed as expected equals the value passed as actual.

    Assert that the value passed as expected equals the value passed as actual. If the actual value equals the expected value (as determined by ==), assertResult returns normally. Else, assertResult throws a TestFailedException whose detail message includes the expected and actual values.

    expected

    the expected value

    actual

    the actual value, which should equal the passed expected value

    Definition Classes
    Assertions
    Exceptions thrown

    TestFailedException if the passed actual value does not equal the passed expected value.

  17. def assertResult(expected: Any, clue: Any)(actual: Any)(implicit prettifier: Prettifier, pos: Position): Assertion

    Permalink

    Assert that the value passed as expected equals the value passed as actual.

    Assert that the value passed as expected equals the value passed as actual. If the actual equals the expected (as determined by ==), assertResult returns normally. Else, if actual is not equal to expected, assertResult throws a TestFailedException whose detail message includes the expected and actual values, as well as the String obtained by invoking toString on the passed clue.

    expected

    the expected value

    clue

    An object whose toString method returns a message to include in a failure report.

    actual

    the actual value, which should equal the passed expected value

    Definition Classes
    Assertions
    Exceptions thrown

    TestFailedException if the passed actual value does not equal the passed expected value.

  18. def assertThrows[T <: AnyRef](f: ⇒ Any)(implicit classTag: ClassTag[T], pos: Position): Assertion

    Permalink

    Ensure that an expected exception is thrown by the passed function value.

    Ensure that an expected exception is thrown by the passed function value. The thrown exception must be an instance of the type specified by the type parameter of this method. This method invokes the passed function. If the function throws an exception that's an instance of the specified type, this method returns Succeeded. Else, whether the passed function returns normally or completes abruptly with a different exception, this method throws TestFailedException.

    Note that the type specified as this method's type parameter may represent any subtype of AnyRef, not just Throwable or one of its subclasses. In Scala, exceptions can be caught based on traits they implement, so it may at times make sense to specify a trait that the intercepted exception's class must mix in. If a class instance is passed for a type that could not possibly be used to catch an exception (such as String, for example), this method will complete abruptly with a TestFailedException.

    Also note that the difference between this method and intercept is that this method does not return the expected exception, so it does not let you perform further assertions on that exception. Instead, this method returns Succeeded, which means it can serve as the last statement in an async- or safe-style suite. It also indicates to the reader of the code that nothing further is expected about the thrown exception other than its type. The recommended usage is to use assertThrows by default, intercept only when you need to inspect the caught exception further.

    f

    the function value that should throw the expected exception

    classTag

    an implicit ClassTag representing the type of the specified type parameter.

    returns

    the Succeeded singleton, if an exception of the expected type is thrown

    Definition Classes
    Assertions
    Exceptions thrown

    TestFailedException if the passed function does not complete abruptly with an exception that's an instance of the specified type.

  19. macro def assertTypeError(code: String)(implicit pos: Position): Assertion

    Permalink

    Asserts that a given string snippet of code does not pass the Scala type checker, failing if the given snippet does not pass the Scala parser.

    Asserts that a given string snippet of code does not pass the Scala type checker, failing if the given snippet does not pass the Scala parser.

    Often when creating libraries you may wish to ensure that certain arrangements of code that represent potential “user errors” do not compile, so that your library is more error resistant. ScalaTest's Assertions trait includes the following syntax for that purpose:

    assertTypeError("val a: String = 1")
    

    Although assertTypeError is implemented with a macro that determines at compile time whether the snippet of code represented by the passed string type checks, errors (i.e., snippets of code that do type check) are reported as test failures at runtime.

    Note that the difference between assertTypeError and assertDoesNotCompile is that assertDoesNotCompile will succeed if the given code does not compile for any reason, whereas assertTypeError will only succeed if the given code does not compile because of a type error. If the given code does not compile because of a syntax error, for example, assertDoesNotCompile will return normally but assertTypeError will throw a TestFailedException.

    code

    the snippet of code that should not type check

    Definition Classes
    Assertions
  20. val assertionsHelper: AssertionsHelper

    Permalink

    Helper instance used by code generated by macro assertion.

    Helper instance used by code generated by macro assertion.

    Definition Classes
    Assertions
  21. macro def assume(condition: Boolean, clue: Any)(implicit prettifier: Prettifier, pos: Position): Assertion

    Permalink

    Assume that a boolean condition, described in String message, is true.

    Assume that a boolean condition, described in String message, is true. If the condition is true, this method returns normally. Else, it throws TestCanceledException with a helpful error message appended with String obtained by invoking toString on the specified clue as the exception's detail message.

    This method is implemented in terms of a Scala macro that will generate a more helpful error message for expressions of this form:

    • assume(a == b, "a good clue")
    • assume(a != b, "a good clue")
    • assume(a === b, "a good clue")
    • assume(a !== b, "a good clue")
    • assume(a > b, "a good clue")
    • assume(a >= b, "a good clue")
    • assume(a < b, "a good clue")
    • assume(a <= b, "a good clue")
    • assume(a startsWith "prefix", "a good clue")
    • assume(a endsWith "postfix", "a good clue")
    • assume(a contains "something", "a good clue")
    • assume(a eq b, "a good clue")
    • assume(a ne b, "a good clue")
    • assume(a > 0 && b > 5, "a good clue")
    • assume(a > 0 || b > 5, "a good clue")
    • assume(a.isEmpty, "a good clue")
    • assume(!a.isEmpty, "a good clue")
    • assume(a.isInstanceOf[String], "a good clue")
    • assume(a.length == 8, "a good clue")
    • assume(a.size == 8, "a good clue")
    • assume(a.exists(_ == 8), "a good clue")

    At this time, any other form of expression will just get a TestCanceledException with message saying the given expression was false. In the future, we will enhance this macro to give helpful error messages in more situations. In ScalaTest 2.0, however, this behavior was sufficient to allow the === that returns Boolean to be the default in tests. This makes === consistent between tests and production code.

    condition

    the boolean condition to assume

    clue

    An objects whose toString method returns a message to include in a failure report.

    Definition Classes
    Assertions
    Exceptions thrown

    NullArgumentException if message is null.

    TestCanceledException if the condition is false.

  22. macro def assume(condition: Boolean)(implicit prettifier: Prettifier, pos: Position): Assertion

    Permalink

    Assume that a boolean condition is true.

    Assume that a boolean condition is true. If the condition is true, this method returns normally. Else, it throws TestCanceledException.

    This method is implemented in terms of a Scala macro that will generate a more helpful error message for expressions of this form:

    • assume(a == b)
    • assume(a != b)
    • assume(a === b)
    • assume(a !== b)
    • assume(a > b)
    • assume(a >= b)
    • assume(a < b)
    • assume(a <= b)
    • assume(a startsWith "prefix")
    • assume(a endsWith "postfix")
    • assume(a contains "something")
    • assume(a eq b)
    • assume(a ne b)
    • assume(a > 0 && b > 5)
    • assume(a > 0 || b > 5)
    • assume(a.isEmpty)
    • assume(!a.isEmpty)
    • assume(a.isInstanceOf[String])
    • assume(a.length == 8)
    • assume(a.size == 8)
    • assume(a.exists(_ == 8))

    At this time, any other form of expression will just get a TestCanceledException with message saying the given expression was false. In the future, we will enhance this macro to give helpful error messages in more situations. In ScalaTest 2.0, however, this behavior was sufficient to allow the === that returns Boolean to be the default in tests. This makes === consistent between tests and production code.

    condition

    the boolean condition to assume

    Definition Classes
    Assertions
    Exceptions thrown

    TestCanceledException if the condition is false.

  23. val behave: BehaveWord

    Permalink

    Supports shared test registration in path.FreeSpecs.

    Supports shared test registration in path.FreeSpecs.

    This field enables syntax such as the following:

    behave like nonFullStack(stackWithOneItem)
    ^
    

    For more information and examples of the use of <cod>behave, see the Shared tests section in the main documentation for sister trait org.scalatest.FreeSpec.

    Attributes
    protected
  24. def cancel(cause: Throwable)(implicit pos: Position): Nothing

    Permalink

    Throws TestCanceledException, with the passed Throwable cause, to indicate a test failed.

    Throws TestCanceledException, with the passed Throwable cause, to indicate a test failed. The getMessage method of the thrown TestCanceledException will return cause.toString.

    cause

    a Throwable that indicates the cause of the cancellation.

    Definition Classes
    Assertions
    Exceptions thrown

    NullArgumentException if cause is null

  25. def cancel(message: String, cause: Throwable)(implicit pos: Position): Nothing

    Permalink

    Throws TestCanceledException, with the passed String message as the exception's detail message and Throwable cause, to indicate a test failed.

    Throws TestCanceledException, with the passed String message as the exception's detail message and Throwable cause, to indicate a test failed.

    message

    A message describing the failure.

    cause

    A Throwable that indicates the cause of the failure.

    Definition Classes
    Assertions
    Exceptions thrown

    NullArgumentException if message or cause is null

  26. def cancel(message: String)(implicit pos: Position): Nothing

    Permalink

    Throws TestCanceledException, with the passed String message as the exception's detail message, to indicate a test was canceled.

    Throws TestCanceledException, with the passed String message as the exception's detail message, to indicate a test was canceled.

    message

    A message describing the cancellation.

    Definition Classes
    Assertions
    Exceptions thrown

    NullArgumentException if message is null

  27. def cancel()(implicit pos: Position): Nothing

    Permalink

    Throws TestCanceledException to indicate a test was canceled.

    Throws TestCanceledException to indicate a test was canceled.

    Definition Classes
    Assertions
  28. def clone(): AnyRef

    Permalink
    Attributes
    protected[java.lang]
    Definition Classes
    AnyRef
    Annotations
    @throws( ... )
  29. def conversionCheckedConstraint[A, B](implicit equivalenceOfA: Equivalence[A], cnv: (B) ⇒ A): CanEqual[A, B]

    Permalink
    Definition Classes
    TripleEquals → TripleEqualsSupport
  30. def convertEquivalenceToAToBConstraint[A, B](equivalenceOfB: Equivalence[B])(implicit ev: <:<[A, B]): CanEqual[A, B]

    Permalink
    Definition Classes
    TripleEquals → TripleEqualsSupport
  31. def convertEquivalenceToAToBConversionConstraint[A, B](equivalenceOfB: Equivalence[B])(implicit ev: (A) ⇒ B): CanEqual[A, B]

    Permalink
    Definition Classes
    TripleEquals → TripleEqualsSupport
  32. def convertEquivalenceToBToAConstraint[A, B](equivalenceOfA: Equivalence[A])(implicit ev: <:<[B, A]): CanEqual[A, B]

    Permalink
    Definition Classes
    TripleEquals → TripleEqualsSupport
  33. def convertEquivalenceToBToAConversionConstraint[A, B](equivalenceOfA: Equivalence[A])(implicit ev: (B) ⇒ A): CanEqual[A, B]

    Permalink
    Definition Classes
    TripleEquals → TripleEqualsSupport
  34. def convertToCheckingEqualizer[T](left: T): CheckingEqualizer[T]

    Permalink
    Definition Classes
    TripleEquals → TripleEqualsSupport
  35. implicit def convertToEqualizer[T](left: T): Equalizer[T]

    Permalink
    Definition Classes
    TripleEquals → TripleEqualsSupport
  36. implicit def convertToFreeSpecStringWrapper(s: String)(implicit pos: Position): FreeSpecStringWrapper

    Permalink

    Implicitly converts Strings to FreeSpecStringWrapper, which enables methods in, is, taggedAs and ignore, as well as the dash operator (-), to be invoked on Strings.

    Implicitly converts Strings to FreeSpecStringWrapper, which enables methods in, is, taggedAs and ignore, as well as the dash operator (-), to be invoked on Strings.

    Attributes
    protected
  37. def defaultEquality[A]: Equality[A]

    Permalink
    Definition Classes
    TripleEqualsSupport
  38. final def eq(arg0: AnyRef): Boolean

    Permalink
    Definition Classes
    AnyRef
  39. def equals(arg0: Any): Boolean

    Permalink
    Definition Classes
    AnyRef → Any
  40. final def expectedTestCount(filter: Filter): Int

    Permalink

    The total number of tests that are expected to run when this path.FreeSpec's run method is invoked.

    The total number of tests that are expected to run when this path.FreeSpec's run method is invoked.

    This trait's implementation of this method will first ensure that the results of all tests, each run its its own instance executing only the path to the test, are registered. For details on this process see the How it executes section in the main documentation for this trait.

    This trait's implementation of this method returns the size of the testNames List, minus the number of tests marked as ignored as well as any tests excluded by the passed Filter.

    This trait's implementation of this method is marked as final. For insight onto why, see the Shared fixtures section in the main documentation for this trait.

    filter

    a Filter with which to filter tests to count based on their tags

    Definition Classes
    FreeSpecLikeSuiteMixinSuite
  41. def fail(cause: Throwable)(implicit pos: Position): Nothing

    Permalink

    Throws TestFailedException, with the passed Throwable cause, to indicate a test failed.

    Throws TestFailedException, with the passed Throwable cause, to indicate a test failed. The getMessage method of the thrown TestFailedException will return cause.toString.

    cause

    a Throwable that indicates the cause of the failure.

    Definition Classes
    Assertions
    Exceptions thrown

    NullArgumentException if cause is null

  42. def fail(message: String, cause: Throwable)(implicit pos: Position): Nothing

    Permalink

    Throws TestFailedException, with the passed String message as the exception's detail message and Throwable cause, to indicate a test failed.

    Throws TestFailedException, with the passed String message as the exception's detail message and Throwable cause, to indicate a test failed.

    message

    A message describing the failure.

    cause

    A Throwable that indicates the cause of the failure.

    Definition Classes
    Assertions
    Exceptions thrown

    NullArgumentException if message or cause is null

  43. def fail(message: String)(implicit pos: Position): Nothing

    Permalink

    Throws TestFailedException, with the passed String message as the exception's detail message, to indicate a test failed.

    Throws TestFailedException, with the passed String message as the exception's detail message, to indicate a test failed.

    message

    A message describing the failure.

    Definition Classes
    Assertions
    Exceptions thrown

    NullArgumentException if message is null

  44. def fail()(implicit pos: Position): Nothing

    Permalink

    Throws TestFailedException to indicate a test failed.

    Throws TestFailedException to indicate a test failed.

    Definition Classes
    Assertions
  45. def finalize(): Unit

    Permalink
    Attributes
    protected[java.lang]
    Definition Classes
    AnyRef
    Annotations
    @throws( classOf[java.lang.Throwable] )
  46. final def getClass(): Class[_]

    Permalink
    Definition Classes
    AnyRef → Any
  47. def hashCode(): Int

    Permalink
    Definition Classes
    AnyRef → Any
  48. def info: Informer

    Permalink

    Returns an Informer that during test execution will forward strings (and other objects) passed to its apply method to the current reporter.

    Returns an Informer that during test execution will forward strings (and other objects) passed to its apply method to the current reporter. If invoked in a constructor (including within a test, since those are invoked during construction in a path.FreeSpec, it will register the passed string for forwarding later when run is invoked. If invoked from inside a test function, it will record the information and forward it to the current reporter only after the test completed, as recordedEvents of the test completed event, such as TestSucceeded. If invoked at any other time, it will print to the standard output. This method can be called safely by any thread.

    Attributes
    protected
    Definition Classes
    FreeSpecLikeInforming
  49. def intercept[T <: AnyRef](f: ⇒ Any)(implicit classTag: ClassTag[T], pos: Position): T

    Permalink

    Intercept and return an exception that's expected to be thrown by the passed function value.

    Intercept and return an exception that's expected to be thrown by the passed function value. The thrown exception must be an instance of the type specified by the type parameter of this method. This method invokes the passed function. If the function throws an exception that's an instance of the specified type, this method returns that exception. Else, whether the passed function returns normally or completes abruptly with a different exception, this method throws TestFailedException.

    Note that the type specified as this method's type parameter may represent any subtype of AnyRef, not just Throwable or one of its subclasses. In Scala, exceptions can be caught based on traits they implement, so it may at times make sense to specify a trait that the intercepted exception's class must mix in. If a class instance is passed for a type that could not possibly be used to catch an exception (such as String, for example), this method will complete abruptly with a TestFailedException.

    Also note that the difference between this method and assertThrows is that this method returns the expected exception, so it lets you perform further assertions on that exception. By contrast, the assertThrows method returns Succeeded, which means it can serve as the last statement in an async- or safe-style suite. assertThrows also indicates to the reader of the code that nothing further is expected about the thrown exception other than its type. The recommended usage is to use assertThrows by default, intercept only when you need to inspect the caught exception further.

    f

    the function value that should throw the expected exception

    classTag

    an implicit ClassTag representing the type of the specified type parameter.

    returns

    the intercepted exception, if it is of the expected type

    Definition Classes
    Assertions
    Exceptions thrown

    TestFailedException if the passed function does not complete abruptly with an exception that's an instance of the specified type.

  50. final def isInstanceOf[T0]: Boolean

    Permalink
    Definition Classes
    Any
  51. def lowPriorityConversionCheckedConstraint[A, B](implicit equivalenceOfB: Equivalence[B], cnv: (A) ⇒ B): CanEqual[A, B]

    Permalink
    Definition Classes
    TripleEquals → TripleEqualsSupport
  52. def lowPriorityTypeCheckedConstraint[A, B](implicit equivalenceOfB: Equivalence[B], ev: <:<[A, B]): CanEqual[A, B]

    Permalink
    Definition Classes
    TripleEquals → TripleEqualsSupport
  53. def markup: Documenter

    Permalink

    Returns a Documenter that during test execution will forward strings (and other objects) passed to its apply method to the current reporter.

    Returns a Documenter that during test execution will forward strings (and other objects) passed to its apply method to the current reporter. If invoked in a constructor (including within a test, since those are invoked during construction in a path.FreeSpec, it will register the passed string for forwarding later when run is invoked. If invoked from inside a test function, it will record the information and forward it to the current reporter only after the test completed, as recordedEvents of the test completed event, such as TestSucceeded. If invoked at any other time, it will print to the standard output. This method can be called safely by any thread.

    Attributes
    protected
    Definition Classes
    FreeSpecLikeDocumenting
  54. final def ne(arg0: AnyRef): Boolean

    Permalink
    Definition Classes
    AnyRef
  55. final def nestedSuites: IndexedSeq[Suite]

    Permalink

    Returns an empty list.

    Returns an empty list.

    This lifecycle method is unused by this trait. If invoked, it will return an empty list, because nested suites are not allowed in a path.FreeSpec. Because a path.FreeSpec executes tests eagerly at construction time, registering the results of those test runs and reporting them later, the order of nested suites versus test runs would be different in a org.scalatest.path.FreeSpec than in an org.scalatest.FreeSpec. In an org.scalatest.FreeSpec, nested suites are executed then tests are executed. In an org.scalatest.path.FreeSpec it would be the opposite. To make the code easy to reason about, therefore, this is just not allowed. If you want to add nested suites to a path.FreeSpec, you can instead wrap them all in a Suites object and put them in whatever order you wish.

    This trait's implementation of this method is marked as final. For insight onto why, see the Shared fixtures section in the main documentation for this trait.

    Definition Classes
    FreeSpecLikeSuiteMixinSuite
  56. def note: Notifier

    Permalink

    Returns a Notifier that during test execution will forward strings passed to its apply method to the current reporter.

    Returns a Notifier that during test execution will forward strings passed to its apply method to the current reporter. If invoked in a constructor, it will register the passed string for forwarding later during test execution. If invoked while this path.FreeSpec is being executed, such as from inside a test function, it will forward the information to the current reporter immediately. If invoked at any other time, it will print to the standard output. This method can be called safely by any thread.

    Attributes
    protected
    Definition Classes
    FreeSpecLikeNotifying
  57. final def notify(): Unit

    Permalink
    Definition Classes
    AnyRef
  58. final def notifyAll(): Unit

    Permalink
    Definition Classes
    AnyRef
  59. def pending: Assertion with PendingStatement

    Permalink

    Throws TestPendingException to indicate a test is pending.

    Throws TestPendingException to indicate a test is pending.

    A pending test is one that has been given a name but is not yet implemented. The purpose of pending tests is to facilitate a style of testing in which documentation of behavior is sketched out before tests are written to verify that behavior (and often, the before the behavior of the system being tested is itself implemented). Such sketches form a kind of specification of what tests and functionality to implement later.

    To support this style of testing, a test can be given a name that specifies one bit of behavior required by the system being tested. The test can also include some code that sends more information about the behavior to the reporter when the tests run. At the end of the test, it can call method pending, which will cause it to complete abruptly with TestPendingException. Because tests in ScalaTest can be designated as pending with TestPendingException, both the test name and any information sent to the reporter when running the test can appear in the report of a test run. (In other words, the code of a pending test is executed just like any other test.) However, because the test completes abruptly with TestPendingException, the test will be reported as pending, to indicate the actual test, and possibly the functionality it is intended to test, has not yet been implemented.

    Note: This method always completes abruptly with a TestPendingException. Thus it always has a side effect. Methods with side effects are usually invoked with parentheses, as in pending(). This method is defined as a parameterless method, in flagrant contradiction to recommended Scala style, because it forms a kind of DSL for pending tests. It enables tests in suites such as FunSuite or FunSpec to be denoted by placing "(pending)" after the test name, as in:

    test("that style rules are not laws") (pending)
    

    Readers of the code see "pending" in parentheses, which looks like a little note attached to the test name to indicate it is pending. Whereas "(pending()) looks more like a method call, "(pending)" lets readers stay at a higher level, forgetting how it is implemented and just focusing on the intent of the programmer who wrote the code.

    Definition Classes
    Assertions
  60. def pendingUntilFixed(f: ⇒ Unit)(implicit pos: Position): Assertion with PendingStatement

    Permalink

    Execute the passed block of code, and if it completes abruptly, throw TestPendingException, else throw TestFailedException.

    Execute the passed block of code, and if it completes abruptly, throw TestPendingException, else throw TestFailedException.

    This method can be used to temporarily change a failing test into a pending test in such a way that it will automatically turn back into a failing test once the problem originally causing the test to fail has been fixed. At that point, you need only remove the pendingUntilFixed call. In other words, a pendingUntilFixed surrounding a block of code that isn't broken is treated as a test failure. The motivation for this behavior is to encourage people to remove pendingUntilFixed calls when there are no longer needed.

    This method facilitates a style of testing in which tests are written before the code they test. Sometimes you may encounter a test failure that requires more functionality than you want to tackle without writing more tests. In this case you can mark the bit of test code causing the failure with pendingUntilFixed. You can then write more tests and functionality that eventually will get your production code to a point where the original test won't fail anymore. At this point the code block marked with pendingUntilFixed will no longer throw an exception (because the problem has been fixed). This will in turn cause pendingUntilFixed to throw TestFailedException with a detail message explaining you need to go back and remove the pendingUntilFixed call as the problem orginally causing your test code to fail has been fixed.

    f

    a block of code, which if it completes abruptly, should trigger a TestPendingException

    Definition Classes
    Assertions
    Exceptions thrown

    TestPendingException if the passed block of code completes abruptly with an Exception or AssertionError

  61. def rerunner: Option[String]

    Permalink

    The fully qualified class name of the rerunner to rerun this suite.

    The fully qualified class name of the rerunner to rerun this suite. This implementation will look at this.getClass and see if it is either an accessible Suite, or it has a WrapWith annotation. If so, it returns the fully qualified class name wrapped in a Some, or else it returns None.

    Definition Classes
    Suite
  62. final def run(testName: Option[String], args: Args): Status

    Permalink

    Runs this path.FreeSpec, reporting test results that were registered when the tests were run, each during the construction of its own instance.

    Runs this path.FreeSpec, reporting test results that were registered when the tests were run, each during the construction of its own instance.

    This trait's implementation of this method will first ensure that the results of all tests, each run its its own instance executing only the path to the test, are registered. For details on this process see the How it executes section in the main documentation for this trait.

    If testName is None, this trait's implementation of this method will report the registered results for all tests except any excluded by the passed Filter. If testName is defined, it will report the results of only that named test. Because a path.FreeSpec is not allowed to contain nested suites, this trait's implementation of this method does not call runNestedSuites.

    This trait's implementation of this method is marked as final. For insight onto why, see the Shared fixtures section in the main documentation for this trait.

    testName

    an optional name of one test to run. If None, all relevant tests should be run. I.e., None acts like a wildcard that means run all relevant tests in this Suite.

    args

    the Args for this run

    returns

    a Status object that indicates when all tests and nested suites started by this method have completed, and whether or not a failure occurred.

    Definition Classes
    FreeSpecLikeSuiteMixinSuite
    Exceptions thrown

    IllegalArgumentException if testName is defined, but no test with the specified test name exists in this Suite

    NullArgumentException if any passed parameter is null.

  63. final def runNestedSuites(args: Args): Status

    Permalink

    This lifecycle method is unused by this trait, and is implemented to do nothing.

    This lifecycle method is unused by this trait, and is implemented to do nothing. If invoked, it will just return immediately.

    Nested suites are not allowed in a path.FreeSpec. Because a path.FreeSpec executes tests eagerly at construction time, registering the results of those test runs and reporting them later, the order of nested suites versus test runs would be different in a org.scalatest.path.FreeSpec than in an org.scalatest.FreeSpec. In an org.scalatest.FreeSpec, nested suites are executed then tests are executed. In an org.scalatest.path.FreeSpec it would be the opposite. To make the code easy to reason about, therefore, this is just not allowed. If you want to add nested suites to a path.FreeSpec, you can instead wrap them all in a Suites object and put them in whatever order you wish.

    This trait's implementation of this method is marked as final. For insight onto why, see the Shared fixtures section in the main documentation for this trait.

    args

    the Args for this run

    returns

    a Status object that indicates when all nested suites started by this method have completed, and whether or not a failure occurred.

    Attributes
    protected
    Definition Classes
    FreeSpecLikeSuiteMixinSuite
  64. final def runTest(testName: String, args: Args): Status

    Permalink

    Runs a test.

    Runs a test.

    This trait's implementation of this method will first ensure that the results of all tests, each run its its own instance executing only the path to the test, are registered. For details on this process see the How it executes section in the main documentation for this trait.

    This trait's implementation reports the test results registered with the name specified by testName. Each test's name is a concatenation of the text of all describers surrounding a test, from outside in, and the test's spec text, with one space placed between each item. (See the documentation for testNames for an example.)

    This trait's implementation of this method is marked as final. For insight onto why, see the Shared fixtures section in the main documentation for this trait.

    testName

    the name of one test to execute.

    args

    the Args for this run

    returns

    a Status object that indicates when the test started by this method has completed, and whether or not it failed [email protected] NullArgumentException if any of testName, reporter, stopper, or configMap is null.

    Attributes
    protected
    Definition Classes
    FreeSpecLikeOneInstancePerTestSuiteMixinSuite
  65. final def runTests(testName: Option[String], args: Args): Status

    Permalink

    This lifecycle method is unused by this trait, and will complete abruptly with UnsupportedOperationException if invoked.

    This lifecycle method is unused by this trait, and will complete abruptly with UnsupportedOperationException if invoked.

    This trait's implementation of this method is marked as final. For insight onto why, see the Shared fixtures section in the main documentation for this trait.

    testName

    an optional name of one test to run. If None, all relevant tests should be run. I.e., None acts like a wildcard that means run all relevant tests in this Suite.

    args

    the Args for this run

    returns

    a Status object that indicates when all tests started by this method have completed, and whether or not a failure occurred.

    Attributes
    protected
    Definition Classes
    FreeSpecLikeOneInstancePerTestSuiteMixinSuite
  66. final val styleName: String

    Permalink

    Suite style name.

    Suite style name.

    Definition Classes
    FreeSpecLikeSuiteMixinSuite
  67. final val succeed: Assertion

    Permalink

    The Succeeded singleton.

    The Succeeded singleton.

    You can use succeed to solve a type error when an async test does not end in either Future[Assertion] or Assertion. Because Assertion is a type alias for Succeeded.type, putting succeed at the end of a test body (or at the end of a function being used to map the final future of a test body) will solve the type error.

    Definition Classes
    Assertions
  68. def suiteId: String

    Permalink

    A string ID for this Suite that is intended to be unique among all suites reported during a run.

    A string ID for this Suite that is intended to be unique among all suites reported during a run.

    This trait's implementation of this method returns the fully qualified name of this object's class. Each suite reported during a run will commonly be an instance of a different Suite class, and in such cases, this default implementation of this method will suffice. However, in special cases you may need to override this method to ensure it is unique for each reported suite. For example, if you write a Suite subclass that reads in a file whose name is passed to its constructor and dynamically creates a suite of tests based on the information in that file, you will likely need to override this method in your Suite subclass, perhaps by appending the pathname of the file to the fully qualified class name. That way if you run a suite of tests based on a directory full of these files, you'll have unique suite IDs for each reported suite.

    The suite ID is intended to be unique, because ScalaTest does not enforce that it is unique. If it is not unique, then you may not be able to uniquely identify a particular test of a particular suite. This ability is used, for example, to dynamically tag tests as having failed in the previous run when rerunning only failed tests.

    returns

    this Suite object's ID.

    Definition Classes
    Suite
  69. def suiteName: String

    Permalink

    A user-friendly suite name for this Suite.

    A user-friendly suite name for this Suite.

    This trait's implementation of this method returns the simple name of this object's class. This trait's implementation of runNestedSuites calls this method to obtain a name for Reports to pass to the suiteStarting, suiteCompleted, and suiteAborted methods of the Reporter.

    returns

    this Suite object's suite name.

    Definition Classes
    Suite
  70. final def synchronized[T0](arg0: ⇒ T0): T0

    Permalink
    Definition Classes
    AnyRef
  71. final def tags: Map[String, Set[String]]

    Permalink

    A Map whose keys are String tag names to which tests in this path.FreeSpec belong, and values the Set of test names that belong to each tag.

    A Map whose keys are String tag names to which tests in this path.FreeSpec belong, and values the Set of test names that belong to each tag. If this path.FreeSpec contains no tags, this method returns an empty Map.

    This trait's implementation of this method will first ensure that the results of all tests, each run its its own instance executing only the path to the test, are registered. For details on this process see the How it executes section in the main documentation for this trait.

    This trait's implementation returns tags that were passed as strings contained in Tag objects passed to methods test and ignore.

    In addition, this trait's implementation will also auto-tag tests with class level annotations. For example, if you annotate @Ignore at the class level, all test methods in the class will be auto-annotated with @Ignore.

    This trait's implementation of this method is marked as final. For insight onto why, see the Shared fixtures section in the main documentation for this trait.

    Definition Classes
    FreeSpecLikeSuiteMixinSuite
  72. def testDataFor(testName: String, theConfigMap: ConfigMap = ConfigMap.empty): TestData

    Permalink

    Provides a TestData instance for the passed test name, given the passed config map.

    Provides a TestData instance for the passed test name, given the passed config map.

    This method is used to obtain a TestData instance to pass to withFixture(NoArgTest) and withFixture(OneArgTest) and the beforeEach and afterEach methods of trait BeforeAndAfterEach.

    testName

    the name of the test for which to return a TestData instance

    theConfigMap

    the config map to include in the returned TestData

    returns

    a TestData instance for the specified test, which includes the specified config map

    Definition Classes
    FreeSpecLikeSuiteMixinSuite
  73. final def testNames: Set[String]

    Permalink

    An immutable Set of test names.

    An immutable Set of test names. If this FreeSpec contains no tests, this method returns an empty Set.

    This trait's implementation of this method will first ensure that the results of all tests, each run its its own instance executing only the path to the test, are registered. For details on this process see the How it executes section in the main documentation for this trait.

    This trait's implementation of this method will return a set that contains the names of all registered tests. The set's iterator will return those names in the order in which the tests were registered. Each test's name is composed of the concatenation of the text of each surrounding describer, in order from outside in, and the text of the example itself, with all components separated by a space. For example, consider this FreeSpec:

    import org.scalatest.path
    
    class StackSpec extends path.FreeSpec {
      "A Stack" - {
        "when not empty" - {
          "must allow me to pop" in {}
        }
        "when not full" - {
          "must allow me to push" in {}
        }
      }
    }
    

    Invoking testNames on this FreeSpec will yield a set that contains the following two test name strings:

    "A Stack when not empty must allow me to pop"
    "A Stack when not full must allow me to push"
    

    This trait's implementation of this method is marked as final. For insight onto why, see the Shared fixtures section in the main documentation for this trait.

    Definition Classes
    FreeSpecLikeSuiteMixinSuite
  74. def toString(): String

    Permalink
    Definition Classes
    AnyRef → Any
  75. def typeCheckedConstraint[A, B](implicit equivalenceOfA: Equivalence[A], ev: <:<[B, A]): CanEqual[A, B]

    Permalink
    Definition Classes
    TripleEquals → TripleEqualsSupport
  76. implicit def unconstrainedEquality[A, B](implicit equalityOfA: Equality[A]): CanEqual[A, B]

    Permalink
    Definition Classes
    TripleEquals → TripleEqualsSupport
  77. final def wait(): Unit

    Permalink
    Definition Classes
    AnyRef
    Annotations
    @throws( ... )
  78. final def wait(arg0: Long, arg1: Int): Unit

    Permalink
    Definition Classes
    AnyRef
    Annotations
    @throws( ... )
  79. final def wait(arg0: Long): Unit

    Permalink
    Definition Classes
    AnyRef
    Annotations
    @throws( ... )
  80. def withClue[T](clue: Any)(fun: ⇒ T): T

    Permalink

    Executes the block of code passed as the second parameter, and, if it completes abruptly with a ModifiableMessage exception, prepends the "clue" string passed as the first parameter to the beginning of the detail message of that thrown exception, then rethrows it.

    Executes the block of code passed as the second parameter, and, if it completes abruptly with a ModifiableMessage exception, prepends the "clue" string passed as the first parameter to the beginning of the detail message of that thrown exception, then rethrows it. If clue does not end in a white space character, one space will be added between it and the existing detail message (unless the detail message is not defined).

    This method allows you to add more information about what went wrong that will be reported when a test fails. Here's an example:

    withClue("(Employee's name was: " + employee.name + ")") {
      intercept[IllegalArgumentException] {
        employee.getTask(-1)
      }
    }
    

    If an invocation of intercept completed abruptly with an exception, the resulting message would be something like:

    (Employee's name was Bob Jones) Expected IllegalArgumentException to be thrown, but no exception was thrown
    

    Definition Classes
    Assertions
    Exceptions thrown

    NullArgumentException if the passed clue is null

Deprecated Value Members

  1. def trap[T](f: ⇒ T): Throwable

    Permalink

    Trap and return any thrown exception that would normally cause a ScalaTest test to fail, or create and return a new RuntimeException indicating no exception is thrown.

    Trap and return any thrown exception that would normally cause a ScalaTest test to fail, or create and return a new RuntimeException indicating no exception is thrown.

    This method is intended to be used in the Scala interpreter to eliminate large stack traces when trying out ScalaTest assertions and matcher expressions. It is not intended to be used in regular test code. If you want to ensure that a bit of code throws an expected exception, use intercept, not trap. Here's an example interpreter session without trap:

    scala> import org.scalatest._
    import org.scalatest._
    
    scala> import Matchers._
    import Matchers._
    
    scala> val x = 12
    a: Int = 12
    
    scala> x shouldEqual 13
    org.scalatest.exceptions.TestFailedException: 12 did not equal 13
       at org.scalatest.Assertions$class.newAssertionFailedException(Assertions.scala:449)
       at org.scalatest.Assertions$.newAssertionFailedException(Assertions.scala:1203)
       at org.scalatest.Assertions$AssertionsHelper.macroAssertTrue(Assertions.scala:417)
       at .<init>(<console>:15)
       at .<clinit>(<console>)
       at .<init>(<console>:7)
       at .<clinit>(<console>)
       at $print(<console>)
       at sun.reflect.NativeMethodAccessorImpl.invoke0(Native Method)
       at sun.reflect.NativeMethodAccessorImpl.invoke(NativeMethodAccessorImpl.java:39)
       at sun.reflect.DelegatingMethodAccessorImpl.invoke(DelegatingMethodAccessorImpl.java:25)
       at java.lang.reflect.Method.invoke(Method.java:597)
       at scala.tools.nsc.interpreter.IMain$ReadEvalPrint.call(IMain.scala:731)
       at scala.tools.nsc.interpreter.IMain$Request.loadAndRun(IMain.scala:980)
       at scala.tools.nsc.interpreter.IMain.loadAndRunReq$1(IMain.scala:570)
       at scala.tools.nsc.interpreter.IMain.interpret(IMain.scala:601)
       at scala.tools.nsc.interpreter.IMain.interpret(IMain.scala:565)
       at scala.tools.nsc.interpreter.ILoop.reallyInterpret$1(ILoop.scala:745)
       at scala.tools.nsc.interpreter.ILoop.interpretStartingWith(ILoop.scala:790)
       at scala.tools.nsc.interpreter.ILoop.command(ILoop.scala:702)
       at scala.tools.nsc.interpreter.ILoop.processLine$1(ILoop.scala:566)
       at scala.tools.nsc.interpreter.ILoop.innerLoop$1(ILoop.scala:573)
       at scala.tools.nsc.interpreter.ILoop.loop(ILoop.scala:576)
       at scala.tools.nsc.interpreter.ILoop$$anonfun$process$1.apply$mcZ$sp(ILoop.scala:867)
       at scala.tools.nsc.interpreter.ILoop$$anonfun$process$1.apply(ILoop.scala:822)
       at scala.tools.nsc.interpreter.ILoop$$anonfun$process$1.apply(ILoop.scala:822)
       at scala.tools.nsc.util.ScalaClassLoader$.savingContextLoader(ScalaClassLoader.scala:135)
       at scala.tools.nsc.interpreter.ILoop.process(ILoop.scala:822)
       at scala.tools.nsc.MainGenericRunner.runTarget$1(MainGenericRunner.scala:83)
       at scala.tools.nsc.MainGenericRunner.process(MainGenericRunner.scala:96)
       at scala.tools.nsc.MainGenericRunner$.main(MainGenericRunner.scala:105)
       at scala.tools.nsc.MainGenericRunner.main(MainGenericRunner.scala)
    

    That's a pretty tall stack trace. Here's what it looks like when you use trap:

    scala> trap { x shouldEqual 13 }
    res1: Throwable = org.scalatest.exceptions.TestFailedException: 12 did not equal 13
    

    Much less clutter. Bear in mind, however, that if no exception is thrown by the passed block of code, the trap method will create a new NormalResult (a subclass of Throwable made for this purpose only) and return that. If the result was the Unit value, it will simply say that no exception was thrown:

    scala> trap { x shouldEqual 12 }
    res2: Throwable = No exception was thrown.
    

    If the passed block of code results in a value other than Unit, the NormalResult's toString will print the value:

    scala> trap { "Dude!" }
    res3: Throwable = No exception was thrown. Instead, result was: "Dude!"
    

    Although you can access the result value from the NormalResult, its type is Any and therefore not very convenient to use. It is not intended that trap be used in test code. The sole intended use case for trap is decluttering Scala interpreter sessions by eliminating stack traces when executing assertion and matcher expressions.

    Definition Classes
    Assertions
    Annotations
    @deprecated
    Deprecated

    The trap method is no longer needed for demos in the REPL, which now abreviates stack traces, and will be removed in a future version of ScalaTest

Inherited from Documenting

Inherited from Alerting

Inherited from Notifying

Inherited from Informing

Inherited from OneInstancePerTest

Inherited from SuiteMixin

Inherited from Suite

Inherited from Serializable

Inherited from Serializable

Inherited from Assertions

Inherited from TripleEquals

Inherited from TripleEqualsSupport

Inherited from AnyRef

Inherited from Any

Ungrouped